Project

General

Profile

gapk-conv-dec-ti_efr-broken-openSUSE-Tumbleweed-full-buildlog.txt

OBS buildlog + testsuite.log - roox, 02/12/2018 07:34 PM

 
1
[    0s] Memory limit set to 12353116KB
2
[    0s] Using BUILD_ROOT=/var/tmp/build-root/openSUSE_Tumbleweed-x86_64
3
[    0s] Using BUILD_ARCH=x86_64:i686:i586:i486:i386
4
[    0s] 
5
[    0s] 
6
[    0s] build-new started "build gapk.spec" at Mon Feb 12 19:06:00 UTC 2018.
7
[    0s] 
8
[    0s] 
9
[    0s] processing recipe /home/mhauke/Projects/home:mnhauke:osmocom:nightly/gapk/gapk.spec ...
10
[    0s] running changelog2spec --target rpm --file /home/mhauke/Projects/home:mnhauke:osmocom:nightly/gapk/gapk.spec
11
[    0s] init_buildsystem --configdir /usr/lib/build/configs --cachedir /var/cache/build --clean --rpmlist /tmp/rpmlist.H07CRe /home/mhauke/Projects/home:mnhauke:osmocom:nightly/gapk/gapk.spec ...
12
[    1s] [1/28] preinstalling filesystem...
13
[    1s] [2/28] preinstalling glibc...
14
[    1s] [3/28] preinstalling fillup...
15
[    1s] [4/28] preinstalling libattr1...
16
[    1s] [5/28] preinstalling libbz2-1...
17
[    1s] [6/28] preinstalling libcap2...
18
[    1s] [7/28] preinstalling libgcc_s1...
19
[    1s] [8/28] preinstalling liblua5_3-5...
20
[    1s] [9/28] preinstalling liblzma5...
21
[    1s] [10/28] preinstalling libpcre1...
22
[    1s] [11/28] preinstalling libpopt0...
23
[    1s] [12/28] preinstalling libz1...
24
[    1s] [13/28] preinstalling attr...
25
[    1s] [14/28] preinstalling libacl1...
26
[    1s] [15/28] preinstalling libelf1...
27
[    1s] [16/28] preinstalling libncurses6...
28
[    1s] [17/28] preinstalling libselinux1...
29
[    1s] [18/28] preinstalling libreadline7...
30
[    1s] [19/28] preinstalling tar...
31
[    1s] [20/28] preinstalling bash...
32
[    2s] [21/28] preinstalling diffutils...
33
[    2s] [22/28] preinstalling grep...
34
[    2s] [23/28] preinstalling sed...
35
[    2s] [24/28] preinstalling coreutils...
36
[    2s] [25/28] preinstalling aaa_base...
37
[    2s] [26/28] preinstalling permissions...
38
[    2s] [27/28] preinstalling rpm...
39
[    2s] [28/28] preinstalling pam...
40
[    2s] 
41
[    2s] running aaa_base preinstall script
42
[    2s] running aaa_base postinstall script
43
[    2s] Updating /etc/sysconfig/language ...
44
[    2s] Updating /etc/sysconfig/proxy ...
45
[    2s] Updating /etc/sysconfig/windowmanager ...
46
[    2s] chown: invalid user: 'root:root'
47
[    2s] chown: invalid user: 'root:root'
48
[    2s] initializing rpm db...
49
[    2s] reordering...cycle: libcrack2 -> cracklib
50
[    2s]   breaking dependency libcrack2 -> cracklib
51
[    2s] cycle: libdw1 -> libelf1 -> libebl-plugins
52
[    2s]   breaking dependency libebl-plugins -> libdw1
53
[    2s] cycle: libelf1 -> libebl-plugins
54
[    2s]   breaking dependency libelf1 -> libebl-plugins
55
[    3s] done
56
[    3s] querying package ids...
57
[    3s] [1/151] cumulate file-magic-5.32-4.1
58
[    3s] [2/151] cumulate kernel-obs-build-4.15.2-1.4
59
[    3s] [3/151] cumulate libtirpc-netconfig-1.0.2-1.4
60
[    3s] [4/151] cumulate python-rpm-macros-2017.12.22.d9968ab-1.1
61
[    3s] [5/151] cumulate system-user-root-20170617-1.8
62
[    3s] [6/151] cumulate terminfo-base-6.1-1.1
63
[    3s] [7/151] cumulate filesystem-15.5-20.1
64
[    3s] [8/151] cumulate glibc-2.26-9.1
65
[    3s] [9/151] cumulate fillup-1.42-274.1
66
[    3s] [10/151] cumulate libasound2-1.1.5-4.1
67
[    3s] [11/151] cumulate libatomic1-7.3.0+r257042-1.3
68
[    3s] [12/151] cumulate libattr1-2.4.47-7.113
69
[    3s] [13/151] cumulate libaudit1-2.8.1-2.1
70
[    3s] [14/151] cumulate libbz2-1-1.0.6-40.4
71
[    3s] [15/151] cumulate libcap-ng0-0.7.8-1.12
72
[    3s] [16/151] cumulate libcap2-2.25-3.11
73
[    3s] [17/151] cumulate libcom_err2-1.43.8-2.1
74
[    3s] [18/151] cumulate libexpat1-2.2.5-1.1
75
[    3s] [19/151] cumulate libffi7-3.2.1.git259-4.3
76
[    3s] [20/151] cumulate libgcc_s1-7.3.0+r257042-1.3
77
[    3s] [21/151] cumulate libgdbm4-1.12-1.31
78
[    3s] [22/151] cumulate libgmp10-6.1.2-2.11
79
[    3s] [23/151] cumulate libgomp1-7.3.0+r257042-1.3
80
[    3s] [24/151] cumulate libgsm1-1.0.14-2.9
81
[    3s] [25/151] cumulate libitm1-7.3.0+r257042-1.3
82
[    3s] [26/151] cumulate libkeyutils1-1.5.10-2.4
83
[    3s] [27/151] cumulate libltdl7-2.4.6-4.81
84
[    3s] [28/151] cumulate liblua5_3-5-5.3.4-1.5
85
[    3s] [29/151] cumulate liblzma5-5.2.3-4.7
86
[    3s] [30/151] cumulate libmnl0-1.0.4-1.5
87
[    3s] [31/151] cumulate libmpx2-7.3.0+r257042-1.3
88
[    3s] [32/151] cumulate libmpxwrappers2-7.3.0+r257042-1.3
89
[    3s] [33/151] cumulate libopencore-amrnb0-0.1.5-2.1
90
[    3s] [34/151] cumulate libopencore-amrwb0-0.1.5-2.1
91
[    3s] [35/151] cumulate libpcre1-8.41-3.4
92
[    3s] [36/151] cumulate libpopt0-1.16-29.5
93
[    3s] [37/151] cumulate libpython2_7-1_0-2.7.14-5.1
94
[    3s] [38/151] cumulate libpython3_6m1_0-3.6.4-3.1
95
[    3s] [39/151] cumulate libsepol1-2.6-1.4
96
[    3s] [40/151] cumulate libsmartcols1-2.31.1-1.1
97
[    3s] [41/151] cumulate libsqlite3-0-3.22.0-1.1
98
[    3s] [42/151] cumulate libtalloc2-2.1.10-1.3
99
[    3s] [43/151] cumulate libustr-1_0-1-1.0.4-34.112
100
[    3s] [44/151] cumulate libuuid1-2.31.1-1.1
101
[    3s] [45/151] cumulate libverto1-0.2.6-6.4
102
[    3s] [46/151] cumulate libz1-1.2.11-3.9
103
[    3s] [47/151] cumulate patch-2.7.5-1.121
104
[    3s] [48/151] cumulate perl-base-5.26.1-4.1
105
[    3s] [49/151] cumulate pkg-config-0.29.2-1.10
106
[    3s] [50/151] cumulate brp-extract-appdata-2016.05.04-1.4
107
[    3s] [51/151] cumulate build-mkbaselibs-20180124-1.1
108
[    3s] [52/151] cumulate libgsm-devel-1.0.14-2.9
109
[    3s] [53/151] cumulate attr-2.4.47-7.113
110
[    3s] [54/151] cumulate libacl1-2.2.52-13.6
111
[    3s] [55/151] cumulate libasan4-7.3.0+r257042-1.3
112
[    3s] [56/151] cumulate libblkid1-2.31.1-1.1
113
[    3s] [57/151] cumulate libisl15-0.18-2.1
114
[    3s] [58/151] cumulate liblsan0-7.3.0+r257042-1.3
115
[    3s] [59/151] cumulate libmpfr6-4.0.1-1.1
116
[    3s] [60/151] cumulate libopenssl1_1_0-1.1.0g-5.1
117
[    3s] [61/151] cumulate libosmocore9-0.10.2.155-59.1
118
[    3s] [62/151] cumulate libselinux1-2.6-1.4
119
[    3s] [63/151] cumulate libstdc++6-7.3.0+r257042-1.3
120
[    3s] [64/151] cumulate libtalloc-devel-2.1.10-1.3
121
[    3s] [65/151] cumulate libtsan0-7.3.0+r257042-1.3
122
[    3s] [66/151] cumulate libunwind-1.2.1-1.1
123
[    3s] [67/151] cumulate libmagic1-5.32-4.1
124
[    3s] [68/151] cumulate libzio1-1.06-2.1
125
[    3s] [69/151] cumulate file-5.32-4.1
126
[    3s] [70/151] cumulate libosmocodec0-0.10.2.155-59.1
127
[    3s] [71/151] cumulate libcilkrts5-7.3.0+r257042-1.3
128
[    3s] [72/151] cumulate libdb-4_8-4.8.30-34.1
129
[    3s] [73/151] cumulate libfdisk1-2.31.1-1.1
130
[    3s] [74/151] cumulate libmount1-2.31.1-1.1
131
[    3s] [75/151] cumulate libmpc3-1.1.0-1.1
132
[    3s] [76/151] cumulate libosmocore-devel-0.10.2.155-59.1
133
[    3s] [77/151] cumulate libubsan0-7.3.0+r257042-1.3
134
[    3s] [78/151] cumulate libncurses6-6.1-1.1
135
[    3s] [79/151] cumulate libsemanage1-2.6-1.4
136
[    3s] [80/151] cumulate libosmocodec-devel-0.10.2.155-59.1
137
[    3s] [81/151] cumulate libreadline7-7.0-102.1
138
[    3s] [82/151] cumulate ncurses-utils-6.1-1.1
139
[    3s] [83/151] cumulate cpp7-7.3.0+r257042-1.3
140
[    3s] [84/151] cumulate perl-5.26.1-4.1
141
[    3s] [85/151] cumulate brp-check-suse-84.87+git20170602.cec5415-1.3
142
[    3s] [86/151] cumulate bash-4.4-102.1
143
[    3s] [87/151] cumulate cpp-7-2.9
144
[    3s] [88/151] cumulate bzip2-1.0.6-40.4
145
[    3s] [89/151] cumulate xz-5.2.3-4.7
146
[    3s] [90/151] cumulate info-6.5-2.1
147
[    3s] [91/151] cumulate strace-4.20-2.1
148
[    3s] [92/151] cumulate cpio-2.12-4.10
149
[    3s] [93/151] cumulate diffutils-3.6-1.3
150
[    3s] [94/151] cumulate gzip-1.9-1.1
151
[    3s] [95/151] cumulate m4-1.4.18-3.4
152
[    3s] [96/151] cumulate make-4.2.1-5.1
153
[    3s] [97/151] cumulate which-2.21-3.15
154
[    3s] [98/151] cumulate findutils-4.6.0-2.32
155
[    3s] [99/151] cumulate gettext-runtime-mini-0.19.8.1-5.3
156
[    3s] [100/151] cumulate grep-3.1-1.4
157
[    3s] [101/151] cumulate tar-1.29-5.5
158
[    3s] [102/151] cumulate sed-4.4-1.4
159
[    3s] [103/151] cumulate coreutils-8.29-1.1
160
[    3s] [104/151] cumulate systemd-rpm-macros-3-12.1
161
[    3s] [105/151] cumulate linux-glibc-devel-4.15-1.1
162
[    3s] [106/151] cumulate glibc-locale-2.26-9.1
163
[    3s] [107/151] cumulate update-alternatives-1.19.0.4-2.1
164
[    3s] [108/151] cumulate autoconf-2.69-15.11
165
[    3s] [109/151] cumulate gettext-tools-mini-0.19.8.1-5.3
166
[    3s] [110/151] cumulate permissions-20180125-1.1
167
[    3s] [111/151] cumulate krb5-mini-1.15.2-4.4
168
[    3s] [112/151] cumulate glibc-devel-2.26-9.1
169
[    3s] [113/151] cumulate libtirpc3-1.0.2-1.4
170
[    3s] [114/151] cumulate automake-1.15.1-3.1
171
[    3s] [115/151] cumulate gawk-4.2.0-1.4
172
[    3s] [116/151] cumulate binutils-2.29.1-5.1
173
[    3s] [117/151] cumulate libnsl2-1.2.0-1.4
174
[    3s] [118/151] cumulate alsa-devel-1.1.5-4.1
175
[    3s] [119/151] cumulate libopencore-amr-devel-0.1.5-2.1
176
[    3s] [120/151] cumulate vim-data-8.0.1442-1.1
177
[    3s] [121/151] cumulate libtool-2.4.6-4.81
178
[    3s] [122/151] cumulate gcc7-7.3.0+r257042-1.3
179
[    3s] [123/151] cumulate gcc-7-2.9
180
[    3s] [124/151] cumulate hostname-3.16-3.3
181
[    3s] [125/151] cumulate python-base-2.7.14-5.1
182
[    3s] [126/151] cumulate vim-8.0.1442-1.1
183
[    3s] [127/151] cumulate python3-base-3.6.4-3.1
184
[    3s] [128/151] cumulate gcc-PIE-7-2.9
185
[    3s] [129/151] cumulate python-2.7.14-5.1
186
[    3s] [130/151] cumulate gdb-8.0.1-3.4
187
[    3s] [131/151] cumulate libcrack2-2.9.6-1.4
188
[    3s] [132/151] cumulate libelf1-0.168-6.6
189
[    3s] [133/151] cumulate dwz-0.12-3.11
190
[    3s] [134/151] cumulate cracklib-2.9.6-1.4
191
[    3s] [135/151] cumulate libebl-plugins-0.168-6.6
192
[    3s] [136/151] cumulate libdw1-0.168-6.6
193
[    3s] [137/151] cumulate iproute2-4.15.0-1.1
194
[    3s] [138/151] cumulate pam-1.3.0-6.4
195
[    3s] [139/151] cumulate shadow-4.5-6.4
196
[    3s] [140/151] cumulate rpm-4.14.1-1.1
197
[    3s] [141/151] cumulate sysuser-shadow-2.0-2.4
198
[    3s] [142/151] cumulate rpmlint-mini-1.10-5.3
199
[    3s] [143/151] cumulate build-compare-20171204T112209.f06fbac-1.2
200
[    3s] [144/151] cumulate rpmlint-Factory-1.0-92.1
201
[    3s] [145/151] cumulate system-group-hardware-20170617-5.4
202
[    3s] [146/151] cumulate libutempter0-1.1.6-9.7
203
[    3s] [147/151] cumulate util-linux-2.31.1-1.1
204
[    3s] [148/151] cumulate aaa_base-84.87+git20180208.8eeab90-1.1
205
[    3s] [149/151] cumulate rpm-build-4.14.1-1.1
206
[    3s] [150/151] cumulate aaa_base-malloccheck-84.87+git20180208.8eeab90-1.1
207
[    3s] [151/151] cumulate post-build-checks-84.87+git20171221.9eed556-1.1
208
[    3s] now installing cumulated packages
209
[    3s] Preparing...                          ########################################
210
[    4s] Updating / installing...
211
[    4s] system-user-root-20170617-1.8         ########################################
212
[    4s] filesystem-15.5-20.1                  ########################################
213
[    4s] glibc-2.26-9.1                        ########################################
214
[    4s] libz1-1.2.11-3.9                      ########################################
215
[    4s] perl-base-5.26.1-4.1                  ########################################
216
[    4s] libgcc_s1-7.3.0+r257042-1.3           ########################################
217
[    4s] libbz2-1-1.0.6-40.4                   ########################################
218
[    4s] libgmp10-6.1.2-2.11                   ########################################
219
[    4s] liblzma5-5.2.3-4.7                    ########################################
220
[    4s] libstdc++6-7.3.0+r257042-1.3          ########################################
221
[    4s] pkg-config-0.29.2-1.10                ########################################
222
[    4s] fillup-1.42-274.1                     ########################################
223
[    4s] libattr1-2.4.47-7.113                 ########################################
224
[    4s] libacl1-2.2.52-13.6                   ########################################
225
[    4s] libaudit1-2.8.1-2.1                   ########################################
226
[    4s] libdb-4_8-4.8.30-34.1                 ########################################
227
[    4s] libmpfr6-4.0.1-1.1                    ########################################
228
[    4s] libcap2-2.25-3.11                     ########################################
229
[    4s] libexpat1-2.2.5-1.1                   ########################################
230
[    4s] libuuid1-2.31.1-1.1                   ########################################
231
[    4s] libblkid1-2.31.1-1.1                  ########################################
232
[    4s] libmpc3-1.1.0-1.1                     ########################################
233
[    4s] libelf1-0.168-6.6                     ########################################
234
[    4s] libdw1-0.168-6.6                      ########################################
235
[    4s] libebl-plugins-0.168-6.6              ########################################
236
[    4s] libisl15-0.18-2.1                     ########################################
237
[    5s] cpp7-7.3.0+r257042-1.3                ########################################
238
[    6s] libopenssl1_1_0-1.1.0g-5.1            ########################################
239
[    6s] libgomp1-7.3.0+r257042-1.3            ########################################
240
[    6s] libpcre1-8.41-3.4                     ########################################
241
[    6s] libselinux1-2.6-1.4                   ########################################
242
[    6s] libpopt0-1.16-29.5                    ########################################
243
[    6s] libpython2_7-1_0-2.7.14-5.1           ########################################
244
[    6s] libpython3_6m1_0-3.6.4-3.1            ########################################
245
[    6s] libtalloc2-2.1.10-1.3                 ########################################
246
[    6s] libosmocore9-0.10.2.155-59.1          ########################################
247
[    6s] python-rpm-macros-2017.12.22.d9968ab-1########################################
248
[    6s] libosmocodec0-0.10.2.155-59.1         ########################################
249
[    6s] libtalloc-devel-2.1.10-1.3            ########################################
250
[    6s] libmount1-2.31.1-1.1                  ########################################
251
[    6s] dwz-0.12-3.11                         ########################################
252
[    6s] libfdisk1-2.31.1-1.1                  ########################################
253
[    6s] libcilkrts5-7.3.0+r257042-1.3         ########################################
254
[    6s] libubsan0-7.3.0+r257042-1.3           ########################################
255
[    6s] libunwind-1.2.1-1.1                   ########################################
256
[    6s] libzio1-1.06-2.1                      ########################################
257
[    6s] libasan4-7.3.0+r257042-1.3            ########################################
258
[    6s] liblsan0-7.3.0+r257042-1.3            ########################################
259
[    6s] libtsan0-7.3.0+r257042-1.3            ########################################
260
[    6s] libasound2-1.1.5-4.1                  ########################################
261
[    6s] libatomic1-7.3.0+r257042-1.3          ########################################
262
[    6s] libcap-ng0-0.7.8-1.12                 ########################################
263
[    6s] libcom_err2-1.43.8-2.1                ########################################
264
[    6s] libffi7-3.2.1.git259-4.3              ########################################
265
[    6s] libgdbm4-1.12-1.31                    ########################################
266
[    7s] perl-5.26.1-4.1                       ########################################
267
[    8s] libgsm1-1.0.14-2.9                    ########################################
268
[    8s] libitm1-7.3.0+r257042-1.3             ########################################
269
[    8s] libkeyutils1-1.5.10-2.4               ########################################
270
[    8s] libltdl7-2.4.6-4.81                   ########################################
271
[    8s] liblua5_3-5-5.3.4-1.5                 ########################################
272
[    8s] libmnl0-1.0.4-1.5                     ########################################
273
[    8s] libmpx2-7.3.0+r257042-1.3             ########################################
274
[    8s] libmpxwrappers2-7.3.0+r257042-1.3     ########################################
275
[    8s] libopencore-amrnb0-0.1.5-2.1          ########################################
276
[    8s] libopencore-amrwb0-0.1.5-2.1          ########################################
277
[    8s] libsepol1-2.6-1.4                     ########################################
278
[    8s] libsmartcols1-2.31.1-1.1              ########################################
279
[    8s] libsqlite3-0-3.22.0-1.1               ########################################
280
[    8s] libustr-1_0-1-1.0.4-34.112            ########################################
281
[    8s] libsemanage1-2.6-1.4                  ########################################
282
[    8s] libverto1-0.2.6-6.4                   ########################################
283
[    8s] patch-2.7.5-1.121                     ########################################
284
[    8s] terminfo-base-6.1-1.1                 ########################################
285
[    8s] libncurses6-6.1-1.1                   ########################################
286
[    8s] libreadline7-7.0-102.1                ########################################
287
[    8s] bash-4.4-102.1                        ########################################
288
[    8s] info-6.5-2.1                          ########################################
289
[    8s] coreutils-8.29-1.1                    ########################################
290
[    8s] grep-3.1-1.4                          ########################################
291
[    8s] diffutils-3.6-1.3                     ########################################
292
[    8s] permissions-20180125-1.1              ########################################
293
[    8s] Updating /etc/sysconfig/security ...
294
[    8s] Warning: running kernel does not support fscaps
295
[    8s] Checking permissions and ownerships - using the permissions files
296
[    8s] 	/etc/permissions
297
[    8s] 	/etc/permissions.easy
298
[    8s] 	/etc/permissions.local
299
[    8s] setting /dev/full to root:root 0666. (wrong permissions 0622)
300
[    8s] setting /sbin/unix_chkpwd to root:shadow 4755. (wrong owner/group root:root)
301
[    8s] setting /sbin/unix2_chkpwd to root:shadow 4755. (wrong owner/group root:root)
302
[    8s] cpio-2.12-4.10                        ########################################
303
[    8s] sed-4.4-1.4                           ########################################
304
[    8s] update-alternatives-1.19.0.4-2.1      ########################################
305
[    8s] gawk-4.2.0-1.4                        ########################################
306
[    8s] update-alternatives: using /usr/bin/gawk to provide /bin/awk (awk) in auto mode
307
[    9s] binutils-2.29.1-5.1                   ########################################
308
[    9s] update-alternatives: using /usr/bin/ld.bfd to provide /usr/bin/ld (ld) in auto mode
309
[    9s] m4-1.4.18-3.4                         ########################################
310
[    9s] findutils-4.6.0-2.32                  ########################################
311
[    9s] tar-1.29-5.5                          ########################################
312
[   10s] autoconf-2.69-15.11                   ########################################
313
[   10s] automake-1.15.1-3.1                   ########################################
314
[   10s] vim-data-8.0.1442-1.1                 ########################################
315
[   11s] krb5-mini-1.15.2-4.4                  ########################################
316
[   11s] Updating /etc/sysconfig/kadmind ...
317
[   11s] Updating /etc/sysconfig/krb5kdc ...
318
[   11s] systemd-rpm-macros-3-12.1             ########################################
319
[   11s] linux-glibc-devel-4.15-1.1            ########################################
320
[   11s] glibc-devel-2.26-9.1                  ########################################
321
[   14s] gcc7-7.3.0+r257042-1.3                ########################################
322
[   16s] glibc-locale-2.26-9.1                 ########################################
323
[   16s] gzip-1.9-1.1                          ########################################
324
[   16s] make-4.2.1-5.1                        ########################################
325
[   16s] which-2.21-3.15                       ########################################
326
[   17s] gettext-runtime-mini-0.19.8.1-5.3     ########################################
327
[   17s] gettext-tools-mini-0.19.8.1-5.3       ########################################
328
[   17s] cpp-7-2.9                             ########################################
329
[   17s] gcc-7-2.9                             ########################################
330
[   17s] bzip2-1.0.6-40.4                      ########################################
331
[   17s] xz-5.2.3-4.7                          ########################################
332
[   17s] libcrack2-2.9.6-1.4                   ########################################
333
[   17s] cracklib-2.9.6-1.4                    ########################################
334
[   17s] ncurses-utils-6.1-1.1                 ########################################
335
[   17s] libtirpc-netconfig-1.0.2-1.4          ########################################
336
[   17s] libtirpc3-1.0.2-1.4                   ########################################
337
[   17s] libnsl2-1.2.0-1.4                     ########################################
338
[   17s] pam-1.3.0-6.4                         ########################################
339
[   17s] Warning: running kernel does not support fscaps
340
[   17s] Warning: running kernel does not support fscaps
341
[   17s] shadow-4.5-6.4                        ########################################
342
[   17s] Warning: running kernel does not support fscaps
343
[   17s] Warning: running kernel does not support fscaps
344
[   17s] Warning: running kernel does not support fscaps
345
[   17s] Warning: running kernel does not support fscaps
346
[   17s] Warning: running kernel does not support fscaps
347
[   17s] Warning: running kernel does not support fscaps
348
[   17s] Warning: running kernel does not support fscaps
349
[   17s] Warning: running kernel does not support fscaps
350
[   17s] Warning: running kernel does not support fscaps
351
[   17s] sysuser-shadow-2.0-2.4                ########################################
352
[   17s] groupadd -r kmem
353
[   17s] groupadd -r lock
354
[   17s] groupadd -r -g 5 tty
355
[   17s] groupadd -r utmp
356
[   17s] groupadd -r audio
357
[   17s] groupadd -r cdrom
358
[   17s] groupadd -r dialout
359
[   17s] groupadd -r disk
360
[   17s] groupadd -r input
361
[   17s] groupadd -r kvm
362
[   17s] groupadd -r lp
363
[   17s] groupadd -r tape
364
[   17s] groupadd -r video
365
[   17s] system-group-hardware-20170617-5.4    ########################################
366
[   17s] libutempter0-1.1.6-9.7                ########################################
367
[   17s] Warning: running kernel does not support fscaps
368
[   17s] util-linux-2.31.1-1.1                 ########################################
369
[   17s] Warning: running kernel does not support fscaps
370
[   17s] setting /usr/bin/wall to root:tty 2755. (wrong permissions 0755)
371
[   17s] setting /usr/bin/write to root:tty 2755. (wrong permissions 0755)
372
[   17s] Warning: running kernel does not support fscaps
373
[   17s] aaa_base-84.87+git20180208.8eeab90-1.1########################################
374
[   17s] Updating /etc/sysconfig/language ...
375
[   17s] Updating /etc/sysconfig/proxy ...
376
[   17s] Updating /etc/sysconfig/windowmanager ...
377
[   17s] aaa_base-malloccheck-84.87+git20180208########################################
378
[   18s] python-base-2.7.14-5.1                ########################################
379
[   19s] python3-base-3.6.4-3.1                ########################################
380
[   19s] file-magic-5.32-4.1                   ########################################
381
[   19s] libmagic1-5.32-4.1                    ########################################
382
[   20s] rpm-4.14.1-1.1                        ########################################
383
[   20s] Updating /etc/sysconfig/services ...
384
[   20s] file-5.32-4.1                         ########################################
385
[   20s] rpmlint-mini-1.10-5.3                 ########################################
386
[   20s] rpmlint-Factory-1.0-92.1              ########################################
387
[   20s] build-compare-20171204T112209.f06fbac-########################################
388
[   20s] rpm-build-4.14.1-1.1                  ########################################
389
[   21s] gdb-8.0.1-3.4                         ########################################
390
[   21s] python-2.7.14-5.1                     ########################################
391
[   21s] post-build-checks-84.87+git20171221.9e########################################
392
[   21s] hostname-3.16-3.3                     ########################################
393
[   21s] gcc-PIE-7-2.9                         ########################################
394
[   21s] alsa-devel-1.1.5-4.1                  ########################################
395
[   21s] libopencore-amr-devel-0.1.5-2.1       ########################################
396
[   21s] vim-8.0.1442-1.1                      ########################################
397
[   21s] update-alternatives: using /usr/bin/vim-nox11 to provide /usr/bin/vim (vim) in auto mode
398
[   21s] libtool-2.4.6-4.81                    ########################################
399
[   21s] strace-4.20-2.1                       ########################################
400
[   21s] iproute2-4.15.0-1.1                   ########################################
401
[   21s] libgsm-devel-1.0.14-2.9               ########################################
402
[   21s] brp-check-suse-84.87+git20170602.cec54########################################
403
[   21s] libosmocore-devel-0.10.2.155-59.1     ########################################
404
[   21s] libosmocodec-devel-0.10.2.155-59.1    ########################################
405
[   21s] attr-2.4.47-7.113                     ########################################
406
[   21s] brp-extract-appdata-2016.05.04-1.4    ########################################
407
[   21s] build-mkbaselibs-20180124-1.1         ########################################
408
[   22s] kernel-obs-build-4.15.2-1.4           ########################################
409
[   22s] removing nis flags from /var/tmp/build-root/openSUSE_Tumbleweed-x86_64/etc/nsswitch.conf...
410
[   22s] now finalizing build dir...
411
[   22s] cp: omitting directory '/home/mhauke/Projects/home:mnhauke:osmocom:nightly/gapk/gapk'
412
[   22s] Running build time source services...
413
[   23s] -----------------------------------------------------------------
414
[   23s] I have the following modifications for gapk.spec:
415
[   23s] -----------------------------------------------------------------
416
[   23s] ----- building gapk.spec (user abuild)
417
[   23s] -----------------------------------------------------------------
418
[   23s] -----------------------------------------------------------------
419
[   23s] + exec rpmbuild -ba --define '_srcdefattr (-,root,root)' --nosignature --define '_build_create_debug 1' /home/abuild/rpmbuild/SOURCES/gapk.spec
420
[   23s] setting SOURCE_DATE_EPOCH=1517918400
421
[   23s] Executing(%prep): /bin/sh -e /var/tmp/rpm-tmp.onLFiQ
422
[   23s] + umask 022
423
[   23s] + cd /home/abuild/rpmbuild/BUILD
424
[   23s] + cd /home/abuild/rpmbuild/BUILD
425
[   23s] + rm -rf gapk-0.4.60
426
[   23s] + /usr/bin/xz -dc /home/abuild/rpmbuild/SOURCES/gapk-0.4.60.tar.xz
427
[   23s] + /usr/bin/tar -xof -
428
[   23s] + STATUS=0
429
[   23s] + '[' 0 -ne 0 ']'
430
[   23s] + cd gapk-0.4.60
431
[   23s] + /usr/bin/chmod -Rf a+rX,u+w,g-w,o-w .
432
[   23s] + echo 'Patch #1 (gapk-disable-codec-dl-during-build.diff):'
433
[   23s] Patch #1 (gapk-disable-codec-dl-during-build.diff):
434
[   23s] + /usr/bin/patch --no-backup-if-mismatch -p1 --fuzz=0
435
[   23s] patching file libgsmhr/fetch_sources.py
436
[   23s] + echo 'Patch #2 (x.patch):'
437
[   23s] Patch #2 (x.patch):
438
[   23s] + /usr/bin/patch --no-backup-if-mismatch -p1 --fuzz=0
439
[   23s] patching file configure.ac
440
[   23s] patching file tests/Makefile.am
441
[   23s] patching file tests/atlocal.in
442
[   23s] patching file tests/testsuite.at
443
[   23s] + cp /home/abuild/rpmbuild/SOURCES/0606_421.zip libgsmhr/
444
[   23s] + exit 0
445
[   23s] Executing(%build): /bin/sh -e /var/tmp/rpm-tmp.ZmC1v7
446
[   23s] + umask 022
447
[   23s] + cd /home/abuild/rpmbuild/BUILD
448
[   23s] + /usr/bin/rm -rf /home/abuild/rpmbuild/BUILDROOT/gapk-0.4.60-0.x86_64
449
[   23s] ++ dirname /home/abuild/rpmbuild/BUILDROOT/gapk-0.4.60-0.x86_64
450
[   23s] + /usr/bin/mkdir -p /home/abuild/rpmbuild/BUILDROOT
451
[   23s] + /usr/bin/mkdir /home/abuild/rpmbuild/BUILDROOT/gapk-0.4.60-0.x86_64
452
[   23s] + cd gapk-0.4.60
453
[   23s] + echo 0.4.60
454
[   23s] + autoreconf -fi
455
[   27s] libtoolize: putting auxiliary files in '.'.
456
[   27s] libtoolize: copying file './ltmain.sh'
457
[   27s] libtoolize: putting macros in AC_CONFIG_MACRO_DIRS, 'm4'.
458
[   27s] libtoolize: copying file 'm4/libtool.m4'
459
[   27s] libtoolize: copying file 'm4/ltoptions.m4'
460
[   27s] libtoolize: copying file 'm4/ltsugar.m4'
461
[   27s] libtoolize: copying file 'm4/ltversion.m4'
462
[   27s] libtoolize: copying file 'm4/lt~obsolete.m4'
463
[   31s] configure.ac:7: installing './compile'
464
[   31s] configure.ac:7: installing './config.guess'
465
[   31s] configure.ac:7: installing './config.sub'
466
[   31s] configure.ac:6: installing './install-sh'
467
[   31s] configure.ac:6: installing './missing'
468
[   31s] libgsmhr/Makefile.am: installing './depcomp'
469
[   31s] + CFLAGS='-fmessage-length=0 -grecord-gcc-switches -O2 -Wall -D_FORTIFY_SOURCE=2 -fstack-protector-strong -funwind-tables -fasynchronous-unwind-tables -fstack-clash-protection -g'
470
[   31s] + export CFLAGS
471
[   31s] + CXXFLAGS='-fmessage-length=0 -grecord-gcc-switches -O2 -Wall -D_FORTIFY_SOURCE=2 -fstack-protector-strong -funwind-tables -fasynchronous-unwind-tables -fstack-clash-protection -g'
472
[   31s] + export CXXFLAGS
473
[   31s] + FFLAGS='-fmessage-length=0 -grecord-gcc-switches -O2 -Wall -D_FORTIFY_SOURCE=2 -fstack-protector-strong -funwind-tables -fasynchronous-unwind-tables -fstack-clash-protection -g'
474
[   31s] + export FFLAGS
475
[   31s] + ./configure --host=x86_64-suse-linux-gnu --build=x86_64-suse-linux-gnu --program-prefix= --disable-dependency-tracking --prefix=/usr --exec-prefix=/usr --bindir=/usr/bin --sbindir=/usr/sbin --sysconfdir=/etc --datadir=/usr/share --includedir=/usr/include --libdir=/usr/lib64 --libexecdir=/usr/lib --localstatedir=/var --sharedstatedir=/var/lib --mandir=/usr/share/man --infodir=/usr/share/info --disable-dependency-tracking --disable-static
476
[   31s] checking for a BSD-compatible install... /usr/bin/install -c
477
[   31s] checking whether build environment is sane... yes
478
[   31s] checking for a thread-safe mkdir -p... /usr/bin/mkdir -p
479
[   31s] checking for gawk... gawk
480
[   31s] checking whether make sets $(MAKE)... yes
481
[   31s] checking whether make supports nested variables... yes
482
[   31s] checking build system type... x86_64-suse-linux-gnu
483
[   31s] checking host system type... x86_64-suse-linux-gnu
484
[   31s] checking how to print strings... printf
485
[   32s] checking for style of include used by make... GNU
486
[   32s] checking for x86_64-suse-linux-gnu-gcc... no
487
[   32s] checking for gcc... gcc
488
[   32s] checking whether the C compiler works... yes
489
[   32s] checking for C compiler default output file name... a.out
490
[   32s] checking for suffix of executables... 
491
[   32s] checking whether we are cross compiling... no
492
[   32s] checking for suffix of object files... o
493
[   32s] checking whether we are using the GNU C compiler... yes
494
[   32s] checking whether gcc accepts -g... yes
495
[   32s] checking for gcc option to accept ISO C89... none needed
496
[   32s] checking whether gcc understands -c and -o together... yes
497
[   32s] checking dependency style of gcc... none
498
[   32s] checking for a sed that does not truncate output... /usr/bin/sed
499
[   32s] checking for grep that handles long lines and -e... /usr/bin/grep
500
[   32s] checking for egrep... /usr/bin/grep -E
501
[   32s] checking for fgrep... /usr/bin/grep -F
502
[   32s] checking for ld used by gcc... /usr/x86_64-suse-linux/bin/ld
503
[   32s] checking if the linker (/usr/x86_64-suse-linux/bin/ld) is GNU ld... yes
504
[   32s] checking for BSD- or MS-compatible name lister (nm)... /usr/bin/nm -B
505
[   32s] checking the name lister (/usr/bin/nm -B) interface... BSD nm
506
[   32s] checking whether ln -s works... yes
507
[   32s] checking the maximum length of command line arguments... 1572864
508
[   32s] checking how to convert x86_64-suse-linux-gnu file names to x86_64-suse-linux-gnu format... func_convert_file_noop
509
[   32s] checking how to convert x86_64-suse-linux-gnu file names to toolchain format... func_convert_file_noop
510
[   32s] checking for /usr/x86_64-suse-linux/bin/ld option to reload object files... -r
511
[   32s] checking for x86_64-suse-linux-gnu-objdump... no
512
[   32s] checking for objdump... objdump
513
[   32s] checking how to recognize dependent libraries... pass_all
514
[   32s] checking for x86_64-suse-linux-gnu-dlltool... no
515
[   32s] checking for dlltool... no
516
[   32s] checking how to associate runtime and link libraries... printf %s\n
517
[   32s] checking for x86_64-suse-linux-gnu-ar... no
518
[   32s] checking for ar... ar
519
[   32s] checking for archiver @FILE support... @
520
[   32s] checking for x86_64-suse-linux-gnu-strip... no
521
[   32s] checking for strip... strip
522
[   32s] checking for x86_64-suse-linux-gnu-ranlib... no
523
[   32s] checking for ranlib... ranlib
524
[   32s] checking command to parse /usr/bin/nm -B output from gcc object... ok
525
[   32s] checking for sysroot... no
526
[   32s] checking for a working dd... /usr/bin/dd
527
[   32s] checking how to truncate binary pipes... /usr/bin/dd bs=4096 count=1
528
[   32s] checking for x86_64-suse-linux-gnu-mt... no
529
[   32s] checking for mt... no
530
[   32s] checking if : is a manifest tool... no
531
[   32s] checking how to run the C preprocessor... gcc -E
532
[   32s] checking for ANSI C header files... yes
533
[   32s] checking for sys/types.h... yes
534
[   32s] checking for sys/stat.h... yes
535
[   33s] checking for stdlib.h... yes
536
[   33s] checking for string.h... yes
537
[   33s] checking for memory.h... yes
538
[   33s] checking for strings.h... yes
539
[   33s] checking for inttypes.h... yes
540
[   33s] checking for stdint.h... yes
541
[   33s] checking for unistd.h... yes
542
[   33s] checking for dlfcn.h... yes
543
[   33s] checking for objdir... .libs
544
[   33s] checking if gcc supports -fno-rtti -fno-exceptions... no
545
[   33s] checking for gcc option to produce PIC... -fPIC -DPIC
546
[   33s] checking if gcc PIC flag -fPIC -DPIC works... yes
547
[   33s] checking if gcc static flag -static works... no
548
[   33s] checking if gcc supports -c -o file.o... yes
549
[   33s] checking if gcc supports -c -o file.o... (cached) yes
550
[   33s] checking whether the gcc linker (/usr/x86_64-suse-linux/bin/ld -m elf_x86_64) supports shared libraries... yes
551
[   33s] checking whether -lc should be explicitly linked in... no
552
[   33s] checking dynamic linker characteristics... GNU/Linux ld.so
553
[   33s] checking how to hardcode library paths into programs... immediate
554
[   33s] checking whether stripping libraries is possible... yes
555
[   33s] checking if libtool supports shared libraries... yes
556
[   33s] checking whether to build shared libraries... yes
557
[   33s] checking whether to build static libraries... no
558
[   33s] checking whether make supports nested variables... (cached) yes
559
[   33s] checking for a Python interpreter with version >= 2.4... python
560
[   33s] checking for python... /usr/bin/python
561
[   33s] checking for python version... 2.7
562
[   33s] checking for python platform... linux2
563
[   33s] checking for python script directory... ${prefix}/lib/python2.7/site-packages
564
[   33s] checking for python extension module directory... ${exec_prefix}/lib64/python2.7/site-packages
565
[   33s] checking if gcc supports -fvisibility=hidden... yes
566
[   33s] checking for x86_64-suse-linux-gnu-gcc... gcc
567
[   33s] checking whether we are using the GNU C compiler... (cached) yes
568
[   33s] checking whether gcc accepts -g... (cached) yes
569
[   33s] checking for gcc option to accept ISO C89... (cached) none needed
570
[   33s] checking whether gcc understands -c and -o together... (cached) yes
571
[   33s] checking dependency style of gcc... (cached) none
572
[   33s] checking for x86_64-suse-linux-gnu-pkg-config... /usr/bin/x86_64-suse-linux-gnu-pkg-config
573
[   33s] checking pkg-config is at least version 0.9.0... yes
574
[   33s] checking for libosmocore >= 0.3.2... yes
575
[   33s] checking for libosmocodec >= 0.1.25... yes
576
[   33s] checking for alsa... yes
577
[   33s] checking for opencore-amrnb >= 0.1.0... yes
578
[   33s] checking gsm/gsm.h usability... yes
579
[   33s] checking gsm/gsm.h presence... yes
580
[   33s] checking for gsm/gsm.h... yes
581
[   34s] checking for gsm_create in -lgsm... yes
582
[   34s] checking for stdint.h... (cached) yes
583
[   34s] checking for stdlib.h... (cached) yes
584
[   34s] checking for string.h... (cached) yes
585
[   34s] checking for unistd.h... (cached) yes
586
[   34s] checking for inline... inline
587
[   34s] checking for int16_t... yes
588
[   34s] checking for int32_t... yes
589
[   34s] checking for uint16_t... yes
590
[   34s] checking for uint32_t... yes
591
[   34s] checking for uint64_t... yes
592
[   34s] checking for uint8_t... yes
593
[   34s] checking for stdlib.h... (cached) yes
594
[   34s] checking for GNU libc compatible malloc... yes
595
[   34s] checking for memset... yes
596
[   34s] checking that generated files are newer than configure... done
597
[   34s] configure: creating ./config.status
598
[   35s] config.status: creating Makefile
599
[   35s] config.status: creating src/Makefile
600
[   35s] config.status: creating libgsmhr/Makefile
601
[   35s] config.status: creating include/Makefile
602
[   35s] config.status: creating include/gsmhr/Makefile
603
[   35s] config.status: creating libosmogapk.pc
604
[   35s] config.status: creating tests/atlocal
605
[   35s] config.status: creating tests/Makefile
606
[   35s] config.status: creating config.h
607
[   35s] config.status: executing depfiles commands
608
[   35s] config.status: executing libtool commands
609
[   35s] config.status: executing tests/atconfig commands
610
[   35s] + make V=1 -j4
611
[   35s] make  all-recursive
612
[   35s] make[1]: Entering directory '/home/abuild/rpmbuild/BUILD/gapk-0.4.60'
613
[   35s] Making all in include
614
[   35s] make[2]: Entering directory '/home/abuild/rpmbuild/BUILD/gapk-0.4.60/include'
615
[   35s] Making all in gsmhr
616
[   35s] make[3]: Entering directory '/home/abuild/rpmbuild/BUILD/gapk-0.4.60/include/gsmhr'
617
[   35s] make[3]: Nothing to be done for 'all'.
618
[   35s] make[3]: Leaving directory '/home/abuild/rpmbuild/BUILD/gapk-0.4.60/include/gsmhr'
619
[   35s] make[3]: Entering directory '/home/abuild/rpmbuild/BUILD/gapk-0.4.60/include'
620
[   35s] make[3]: Nothing to be done for 'all-am'.
621
[   35s] make[3]: Leaving directory '/home/abuild/rpmbuild/BUILD/gapk-0.4.60/include'
622
[   35s] make[2]: Leaving directory '/home/abuild/rpmbuild/BUILD/gapk-0.4.60/include'
623
[   35s] Making all in libgsmhr
624
[   35s] make[2]: Entering directory '/home/abuild/rpmbuild/BUILD/gapk-0.4.60/libgsmhr'
625
[   35s] ./fetch_sources.py "refsrc"
626
[   35s] for p in "./patches"/*.patch; do	\
627
[   35s] 	cat "$p" | patch -p0 ;			\
628
[   35s] done
629
[   35s] patching file refsrc/dtx.c
630
[   35s] patching file refsrc/err_conc.c
631
[   35s] patching file refsrc/mathhalf.c
632
[   35s] patching file refsrc/mathhalf.h
633
[   35s] patching file refsrc/sp_dec.c
634
[   35s] patching file refsrc/sp_frm.c
635
[   35s] patching file refsrc/sp_sfrm.c
636
[   35s] patching file refsrc/typedefs.h
637
[   35s] patching file refsrc/dtx.c
638
[   35s] patching file refsrc/dtx.c
639
[   35s] patching file refsrc/homing.c
640
[   35s] patching file refsrc/sp_dec.c
641
[   35s] patching file refsrc/sp_dec.h
642
[   35s] patching file refsrc/sp_enc.c
643
[   35s] patching file refsrc/sp_frm.c
644
[   35s] patching file refsrc/sp_frm.h
645
[   35s] patching file refsrc/sp_rom.c
646
[   35s] patching file refsrc/sp_rom.h
647
[   35s] patching file refsrc/sp_sfrm.c
648
[   35s] patching file refsrc/typedefs.h
649
[   35s] patching file refsrc/dtx.c
650
[   35s] patching file refsrc/sp_dec.c
651
[   35s] patching file refsrc/sp_enc.c
652
[   35s] patching file refsrc/mathhalf.c
653
[   35s] patching file refsrc/mathhalf.h
654
[   35s] touch refsrc/.downloaded
655
[   35s] /bin/sh ../libtool  --tag=CC   --mode=compile gcc -DHAVE_CONFIG_H -I. -I..   -I../include -I..  -fPIC -Wall -fvisibility=hidden -fmessage-length=0 -grecord-gcc-switches -O2 -Wall -D_FORTIFY_SOURCE=2 -fstack-protector-strong -funwind-tables -fasynchronous-unwind-tables -fstack-clash-protection -g -c -o refsrc/dtx.lo refsrc/dtx.c
656
[   35s] /bin/sh ../libtool  --tag=CC   --mode=compile gcc -DHAVE_CONFIG_H -I. -I..   -I../include -I..  -fPIC -Wall -fvisibility=hidden -fmessage-length=0 -grecord-gcc-switches -O2 -Wall -D_FORTIFY_SOURCE=2 -fstack-protector-strong -funwind-tables -fasynchronous-unwind-tables -fstack-clash-protection -g -c -o refsrc/globdefs.lo refsrc/globdefs.c
657
[   35s] /bin/sh ../libtool  --tag=CC   --mode=compile gcc -DHAVE_CONFIG_H -I. -I..   -I../include -I..  -fPIC -Wall -fvisibility=hidden -fmessage-length=0 -grecord-gcc-switches -O2 -Wall -D_FORTIFY_SOURCE=2 -fstack-protector-strong -funwind-tables -fasynchronous-unwind-tables -fstack-clash-protection -g -c -o refsrc/host.lo refsrc/host.c
658
[   35s] /bin/sh ../libtool  --tag=CC   --mode=compile gcc -DHAVE_CONFIG_H -I. -I..   -I../include -I..  -fPIC -Wall -fvisibility=hidden -fmessage-length=0 -grecord-gcc-switches -O2 -Wall -D_FORTIFY_SOURCE=2 -fstack-protector-strong -funwind-tables -fasynchronous-unwind-tables -fstack-clash-protection -g -c -o refsrc/sp_enc.lo refsrc/sp_enc.c
659
[   35s] libtool: compile:  gcc -DHAVE_CONFIG_H -I. -I.. -I../include -I.. -fPIC -Wall -fvisibility=hidden -fmessage-length=0 -grecord-gcc-switches -O2 -Wall -D_FORTIFY_SOURCE=2 -fstack-protector-strong -funwind-tables -fasynchronous-unwind-tables -fstack-clash-protection -g -c refsrc/dtx.c  -fPIC -DPIC -o refsrc/.libs/dtx.o
660
[   35s] libtool: compile:  gcc -DHAVE_CONFIG_H -I. -I.. -I../include -I.. -fPIC -Wall -fvisibility=hidden -fmessage-length=0 -grecord-gcc-switches -O2 -Wall -D_FORTIFY_SOURCE=2 -fstack-protector-strong -funwind-tables -fasynchronous-unwind-tables -fstack-clash-protection -g -c refsrc/sp_enc.c  -fPIC -DPIC -o refsrc/.libs/sp_enc.o
661
[   35s] libtool: compile:  gcc -DHAVE_CONFIG_H -I. -I.. -I../include -I.. -fPIC -Wall -fvisibility=hidden -fmessage-length=0 -grecord-gcc-switches -O2 -Wall -D_FORTIFY_SOURCE=2 -fstack-protector-strong -funwind-tables -fasynchronous-unwind-tables -fstack-clash-protection -g -c refsrc/globdefs.c  -fPIC -DPIC -o refsrc/.libs/globdefs.o
662
[   35s] libtool: compile:  gcc -DHAVE_CONFIG_H -I. -I.. -I../include -I.. -fPIC -Wall -fvisibility=hidden -fmessage-length=0 -grecord-gcc-switches -O2 -Wall -D_FORTIFY_SOURCE=2 -fstack-protector-strong -funwind-tables -fasynchronous-unwind-tables -fstack-clash-protection -g -c refsrc/host.c  -fPIC -DPIC -o refsrc/.libs/host.o
663
[   35s] /bin/sh ../libtool  --tag=CC   --mode=compile gcc -DHAVE_CONFIG_H -I. -I..   -I../include -I..  -fPIC -Wall -fvisibility=hidden -fmessage-length=0 -grecord-gcc-switches -O2 -Wall -D_FORTIFY_SOURCE=2 -fstack-protector-strong -funwind-tables -fasynchronous-unwind-tables -fstack-clash-protection -g -c -o refsrc/sp_rom.lo refsrc/sp_rom.c
664
[   35s] /bin/sh ../libtool  --tag=CC   --mode=compile gcc -DHAVE_CONFIG_H -I. -I..   -I../include -I..  -fPIC -Wall -fvisibility=hidden -fmessage-length=0 -grecord-gcc-switches -O2 -Wall -D_FORTIFY_SOURCE=2 -fstack-protector-strong -funwind-tables -fasynchronous-unwind-tables -fstack-clash-protection -g -c -o refsrc/vad.lo refsrc/vad.c
665
[   35s] refsrc/dtx.c: In function 'gsQuant':
666
[   35s] refsrc/dtx.c:615:10: warning: 'swBestGs' may be used uninitialized in this function [-Wmaybe-uninitialized]
667
[   35s]    return (swBestGs);
668
[   35s]           ^
669
[   35s] /bin/sh ../libtool  --tag=CC   --mode=compile gcc -DHAVE_CONFIG_H -I. -I..   -I../include -I..  -fPIC -Wall -fvisibility=hidden -fmessage-length=0 -grecord-gcc-switches -O2 -Wall -D_FORTIFY_SOURCE=2 -fstack-protector-strong -funwind-tables -fasynchronous-unwind-tables -fstack-clash-protection -g -c -o refsrc/err_conc.lo refsrc/err_conc.c
670
[   35s] libtool: compile:  gcc -DHAVE_CONFIG_H -I. -I.. -I../include -I.. -fPIC -Wall -fvisibility=hidden -fmessage-length=0 -grecord-gcc-switches -O2 -Wall -D_FORTIFY_SOURCE=2 -fstack-protector-strong -funwind-tables -fasynchronous-unwind-tables -fstack-clash-protection -g -c refsrc/sp_rom.c  -fPIC -DPIC -o refsrc/.libs/sp_rom.o
671
[   35s] libtool: compile:  gcc -DHAVE_CONFIG_H -I. -I.. -I../include -I.. -fPIC -Wall -fvisibility=hidden -fmessage-length=0 -grecord-gcc-switches -O2 -Wall -D_FORTIFY_SOURCE=2 -fstack-protector-strong -funwind-tables -fasynchronous-unwind-tables -fstack-clash-protection -g -c refsrc/vad.c  -fPIC -DPIC -o refsrc/.libs/vad.o
672
[   35s] /bin/sh ../libtool  --tag=CC   --mode=compile gcc -DHAVE_CONFIG_H -I. -I..   -I../include -I..  -fPIC -Wall -fvisibility=hidden -fmessage-length=0 -grecord-gcc-switches -O2 -Wall -D_FORTIFY_SOURCE=2 -fstack-protector-strong -funwind-tables -fasynchronous-unwind-tables -fstack-clash-protection -g -c -o refsrc/homing.lo refsrc/homing.c
673
[   35s] libtool: compile:  gcc -DHAVE_CONFIG_H -I. -I.. -I../include -I.. -fPIC -Wall -fvisibility=hidden -fmessage-length=0 -grecord-gcc-switches -O2 -Wall -D_FORTIFY_SOURCE=2 -fstack-protector-strong -funwind-tables -fasynchronous-unwind-tables -fstack-clash-protection -g -c refsrc/err_conc.c  -fPIC -DPIC -o refsrc/.libs/err_conc.o
674
[   35s] /bin/sh ../libtool  --tag=CC   --mode=compile gcc -DHAVE_CONFIG_H -I. -I..   -I../include -I..  -fPIC -Wall -fvisibility=hidden -fmessage-length=0 -grecord-gcc-switches -O2 -Wall -D_FORTIFY_SOURCE=2 -fstack-protector-strong -funwind-tables -fasynchronous-unwind-tables -fstack-clash-protection -g -c -o refsrc/mathdp31.lo refsrc/mathdp31.c
675
[   35s] libtool: compile:  gcc -DHAVE_CONFIG_H -I. -I.. -I../include -I.. -fPIC -Wall -fvisibility=hidden -fmessage-length=0 -grecord-gcc-switches -O2 -Wall -D_FORTIFY_SOURCE=2 -fstack-protector-strong -funwind-tables -fasynchronous-unwind-tables -fstack-clash-protection -g -c refsrc/homing.c  -fPIC -DPIC -o refsrc/.libs/homing.o
676
[   35s] refsrc/homing.c: In function 'decoderHomingFrameTest':
677
[   35s] refsrc/homing.c:154:10: warning: 'j' may be used uninitialized in this function [-Wmaybe-uninitialized]
678
[   35s]    return !j;
679
[   35s]           ^~
680
[   35s] libtool: compile:  gcc -DHAVE_CONFIG_H -I. -I.. -I../include -I.. -fPIC -Wall -fvisibility=hidden -fmessage-length=0 -grecord-gcc-switches -O2 -Wall -D_FORTIFY_SOURCE=2 -fstack-protector-strong -funwind-tables -fasynchronous-unwind-tables -fstack-clash-protection -g -c refsrc/mathdp31.c  -fPIC -DPIC -o refsrc/.libs/mathdp31.o
681
[   36s] /bin/sh ../libtool  --tag=CC   --mode=compile gcc -DHAVE_CONFIG_H -I. -I..   -I../include -I..  -fPIC -Wall -fvisibility=hidden -fmessage-length=0 -grecord-gcc-switches -O2 -Wall -D_FORTIFY_SOURCE=2 -fstack-protector-strong -funwind-tables -fasynchronous-unwind-tables -fstack-clash-protection -g -c -o refsrc/sp_dec.lo refsrc/sp_dec.c
682
[   36s] /bin/sh ../libtool  --tag=CC   --mode=compile gcc -DHAVE_CONFIG_H -I. -I..   -I../include -I..  -fPIC -Wall -fvisibility=hidden -fmessage-length=0 -grecord-gcc-switches -O2 -Wall -D_FORTIFY_SOURCE=2 -fstack-protector-strong -funwind-tables -fasynchronous-unwind-tables -fstack-clash-protection -g -c -o refsrc/sp_frm.lo refsrc/sp_frm.c
683
[   36s] libtool: compile:  gcc -DHAVE_CONFIG_H -I. -I.. -I../include -I.. -fPIC -Wall -fvisibility=hidden -fmessage-length=0 -grecord-gcc-switches -O2 -Wall -D_FORTIFY_SOURCE=2 -fstack-protector-strong -funwind-tables -fasynchronous-unwind-tables -fstack-clash-protection -g -c refsrc/sp_dec.c  -fPIC -DPIC -o refsrc/.libs/sp_dec.o
684
[   36s] /bin/sh ../libtool  --tag=CC   --mode=compile gcc -DHAVE_CONFIG_H -I. -I..   -I../include -I..  -fPIC -Wall -fvisibility=hidden -fmessage-length=0 -grecord-gcc-switches -O2 -Wall -D_FORTIFY_SOURCE=2 -fstack-protector-strong -funwind-tables -fasynchronous-unwind-tables -fstack-clash-protection -g -c -o refsrc/sp_sfrm.lo refsrc/sp_sfrm.c
685
[   36s] libtool: compile:  gcc -DHAVE_CONFIG_H -I. -I.. -I../include -I.. -fPIC -Wall -fvisibility=hidden -fmessage-length=0 -grecord-gcc-switches -O2 -Wall -D_FORTIFY_SOURCE=2 -fstack-protector-strong -funwind-tables -fasynchronous-unwind-tables -fstack-clash-protection -g -c refsrc/sp_frm.c  -fPIC -DPIC -o refsrc/.libs/sp_frm.o
686
[   36s] libtool: compile:  gcc -DHAVE_CONFIG_H -I. -I.. -I../include -I.. -fPIC -Wall -fvisibility=hidden -fmessage-length=0 -grecord-gcc-switches -O2 -Wall -D_FORTIFY_SOURCE=2 -fstack-protector-strong -funwind-tables -fasynchronous-unwind-tables -fstack-clash-protection -g -c refsrc/sp_sfrm.c  -fPIC -DPIC -o refsrc/.libs/sp_sfrm.o
687
[   36s] /bin/sh ../libtool  --tag=CC   --mode=compile gcc -DHAVE_CONFIG_H -I. -I..   -I../include -I..  -fPIC -Wall -fvisibility=hidden -fmessage-length=0 -grecord-gcc-switches -O2 -Wall -D_FORTIFY_SOURCE=2 -fstack-protector-strong -funwind-tables -fasynchronous-unwind-tables -fstack-clash-protection -g -c -o libgsmhr.lo libgsmhr.c
688
[   36s] libtool: compile:  gcc -DHAVE_CONFIG_H -I. -I.. -I../include -I.. -fPIC -Wall -fvisibility=hidden -fmessage-length=0 -grecord-gcc-switches -O2 -Wall -D_FORTIFY_SOURCE=2 -fstack-protector-strong -funwind-tables -fasynchronous-unwind-tables -fstack-clash-protection -g -c libgsmhr.c  -fPIC -DPIC -o .libs/libgsmhr.o
689
[   36s] refsrc/sp_frm.c: In function 'compResidEnergy':
690
[   36s] refsrc/sp_frm.c:1507:10: warning: 'swShiftFactor' may be used uninitialized in this function [-Wmaybe-uninitialized]
691
[   36s]           swShiftFactor,
692
[   36s]           ^~~~~~~~~~~~~
693
[   36s] refsrc/sp_sfrm.c: In function 'g_quant_vl':
694
[   36s] refsrc/sp_sfrm.c:850:10: warning: 'siCode' may be used uninitialized in this function [-Wmaybe-uninitialized]
695
[   36s]    return (siCode);
696
[   36s]           ^
697
[   36s] refsrc/sp_dec.c: In function 'speechDecoder':
698
[   36s] refsrc/sp_dec.c:5089:9: warning: 'psiVselpCw[1]' may be used uninitialized in this function [-Wmaybe-uninitialized]
699
[   36s]          b_con(siVselpCw, siNumBits, (Shortword *) pswBitArray);
700
[   36s]          ^~~~~~~~~~~~~~~~~~~~~~~~~~~~~~~~~~~~~~~~~~~~~~~~~~~~~~
701
[   37s] /bin/sh ../libtool  --tag=CC   --mode=link gcc -fPIC -Wall -fvisibility=hidden -fmessage-length=0 -grecord-gcc-switches -O2 -Wall -D_FORTIFY_SOURCE=2 -fstack-protector-strong -funwind-tables -fasynchronous-unwind-tables -fstack-clash-protection -g   -o libgsmhr.la -rpath /usr/lib64 refsrc/dtx.lo refsrc/globdefs.lo refsrc/host.lo refsrc/sp_enc.lo refsrc/sp_rom.lo refsrc/vad.lo refsrc/err_conc.lo refsrc/homing.lo refsrc/mathdp31.lo refsrc/sp_dec.lo refsrc/sp_frm.lo refsrc/sp_sfrm.lo libgsmhr.lo -ldl 
702
[   37s] libtool: link: gcc -shared  -fPIC -DPIC  refsrc/.libs/dtx.o refsrc/.libs/globdefs.o refsrc/.libs/host.o refsrc/.libs/sp_enc.o refsrc/.libs/sp_rom.o refsrc/.libs/vad.o refsrc/.libs/err_conc.o refsrc/.libs/homing.o refsrc/.libs/mathdp31.o refsrc/.libs/sp_dec.o refsrc/.libs/sp_frm.o refsrc/.libs/sp_sfrm.o .libs/libgsmhr.o   -ldl  -grecord-gcc-switches -O2 -fstack-protector-strong -g   -Wl,-soname -Wl,libgsmhr.so.0 -o .libs/libgsmhr.so.0.0.0
703
[   37s] libtool: link: (cd ".libs" && rm -f "libgsmhr.so.0" && ln -s "libgsmhr.so.0.0.0" "libgsmhr.so.0")
704
[   37s] libtool: link: (cd ".libs" && rm -f "libgsmhr.so" && ln -s "libgsmhr.so.0.0.0" "libgsmhr.so")
705
[   37s] libtool: link: ( cd ".libs" && rm -f "libgsmhr.la" && ln -s "../libgsmhr.la" "libgsmhr.la" )
706
[   37s] make[2]: Leaving directory '/home/abuild/rpmbuild/BUILD/gapk-0.4.60/libgsmhr'
707
[   37s] Making all in src
708
[   37s] make[2]: Entering directory '/home/abuild/rpmbuild/BUILD/gapk-0.4.60/src'
709
[   37s] /bin/sh ../libtool  --tag=CC   --mode=compile gcc -DHAVE_CONFIG_H -I. -I..   -I.. -I../include   -Wall -I/usr/include/libosmocore/ -I/usr/include/libosmocore/  -I/usr/include/alsa  -fmessage-length=0 -grecord-gcc-switches -O2 -Wall -D_FORTIFY_SOURCE=2 -fstack-protector-strong -funwind-tables -fasynchronous-unwind-tables -fstack-clash-protection -g -c -o procqueue.lo procqueue.c
710
[   37s] /bin/sh ../libtool  --tag=CC   --mode=compile gcc -DHAVE_CONFIG_H -I. -I..   -I.. -I../include   -Wall -I/usr/include/libosmocore/ -I/usr/include/libosmocore/  -I/usr/include/alsa  -fmessage-length=0 -grecord-gcc-switches -O2 -Wall -D_FORTIFY_SOURCE=2 -fstack-protector-strong -funwind-tables -fasynchronous-unwind-tables -fstack-clash-protection -g -c -o pq_format.lo pq_format.c
711
[   37s] /bin/sh ../libtool  --tag=CC   --mode=compile gcc -DHAVE_CONFIG_H -I. -I..   -I.. -I../include   -Wall -I/usr/include/libosmocore/ -I/usr/include/libosmocore/  -I/usr/include/alsa  -fmessage-length=0 -grecord-gcc-switches -O2 -Wall -D_FORTIFY_SOURCE=2 -fstack-protector-strong -funwind-tables -fasynchronous-unwind-tables -fstack-clash-protection -g -c -o pq_codec.lo pq_codec.c
712
[   37s] /bin/sh ../libtool  --tag=CC   --mode=compile gcc -DHAVE_CONFIG_H -I. -I..   -I.. -I../include   -Wall -I/usr/include/libosmocore/ -I/usr/include/libosmocore/  -I/usr/include/alsa  -fmessage-length=0 -grecord-gcc-switches -O2 -Wall -D_FORTIFY_SOURCE=2 -fstack-protector-strong -funwind-tables -fasynchronous-unwind-tables -fstack-clash-protection -g -c -o pq_file.lo pq_file.c
713
[   37s] libtool: compile:  gcc -DHAVE_CONFIG_H -I. -I.. -I.. -I../include -Wall -I/usr/include/libosmocore/ -I/usr/include/libosmocore/ -I/usr/include/alsa -fmessage-length=0 -grecord-gcc-switches -O2 -Wall -D_FORTIFY_SOURCE=2 -fstack-protector-strong -funwind-tables -fasynchronous-unwind-tables -fstack-clash-protection -g -c pq_file.c  -fPIC -DPIC -o .libs/pq_file.o
714
[   37s] libtool: compile:  gcc -DHAVE_CONFIG_H -I. -I.. -I.. -I../include -Wall -I/usr/include/libosmocore/ -I/usr/include/libosmocore/ -I/usr/include/alsa -fmessage-length=0 -grecord-gcc-switches -O2 -Wall -D_FORTIFY_SOURCE=2 -fstack-protector-strong -funwind-tables -fasynchronous-unwind-tables -fstack-clash-protection -g -c procqueue.c  -fPIC -DPIC -o .libs/procqueue.o
715
[   37s] libtool: compile:  gcc -DHAVE_CONFIG_H -I. -I.. -I.. -I../include -Wall -I/usr/include/libosmocore/ -I/usr/include/libosmocore/ -I/usr/include/alsa -fmessage-length=0 -grecord-gcc-switches -O2 -Wall -D_FORTIFY_SOURCE=2 -fstack-protector-strong -funwind-tables -fasynchronous-unwind-tables -fstack-clash-protection -g -c pq_format.c  -fPIC -DPIC -o .libs/pq_format.o
716
[   37s] libtool: compile:  gcc -DHAVE_CONFIG_H -I. -I.. -I.. -I../include -Wall -I/usr/include/libosmocore/ -I/usr/include/libosmocore/ -I/usr/include/alsa -fmessage-length=0 -grecord-gcc-switches -O2 -Wall -D_FORTIFY_SOURCE=2 -fstack-protector-strong -funwind-tables -fasynchronous-unwind-tables -fstack-clash-protection -g -c pq_codec.c  -fPIC -DPIC -o .libs/pq_codec.o
717
[   37s] /bin/sh ../libtool  --tag=CC   --mode=compile gcc -DHAVE_CONFIG_H -I. -I..   -I.. -I../include   -Wall -I/usr/include/libosmocore/ -I/usr/include/libosmocore/  -I/usr/include/alsa  -fmessage-length=0 -grecord-gcc-switches -O2 -Wall -D_FORTIFY_SOURCE=2 -fstack-protector-strong -funwind-tables -fasynchronous-unwind-tables -fstack-clash-protection -g -c -o pq_alsa.lo pq_alsa.c
718
[   37s] /bin/sh ../libtool  --tag=CC   --mode=compile gcc -DHAVE_CONFIG_H -I. -I..   -I.. -I../include   -Wall -I/usr/include/libosmocore/ -I/usr/include/libosmocore/  -I/usr/include/alsa  -fmessage-length=0 -grecord-gcc-switches -O2 -Wall -D_FORTIFY_SOURCE=2 -fstack-protector-strong -funwind-tables -fasynchronous-unwind-tables -fstack-clash-protection -g -c -o pq_rtp.lo pq_rtp.c
719
[   37s] /bin/sh ../libtool  --tag=CC   --mode=compile gcc -DHAVE_CONFIG_H -I. -I..   -I.. -I../include   -Wall -I/usr/include/libosmocore/ -I/usr/include/libosmocore/  -I/usr/include/alsa  -fmessage-length=0 -grecord-gcc-switches -O2 -Wall -D_FORTIFY_SOURCE=2 -fstack-protector-strong -funwind-tables -fasynchronous-unwind-tables -fstack-clash-protection -g -c -o formats.lo formats.c
720
[   37s] /bin/sh ../libtool  --tag=CC   --mode=compile gcc -DHAVE_CONFIG_H -I. -I..   -I.. -I../include   -Wall -I/usr/include/libosmocore/ -I/usr/include/libosmocore/  -I/usr/include/alsa  -fmessage-length=0 -grecord-gcc-switches -O2 -Wall -D_FORTIFY_SOURCE=2 -fstack-protector-strong -funwind-tables -fasynchronous-unwind-tables -fstack-clash-protection -g -c -o fmt_ti.lo fmt_ti.c
721
[   37s] libtool: compile:  gcc -DHAVE_CONFIG_H -I. -I.. -I.. -I../include -Wall -I/usr/include/libosmocore/ -I/usr/include/libosmocore/ -I/usr/include/alsa -fmessage-length=0 -grecord-gcc-switches -O2 -Wall -D_FORTIFY_SOURCE=2 -fstack-protector-strong -funwind-tables -fasynchronous-unwind-tables -fstack-clash-protection -g -c pq_rtp.c  -fPIC -DPIC -o .libs/pq_rtp.o
722
[   37s] libtool: compile:  gcc -DHAVE_CONFIG_H -I. -I.. -I.. -I../include -Wall -I/usr/include/libosmocore/ -I/usr/include/libosmocore/ -I/usr/include/alsa -fmessage-length=0 -grecord-gcc-switches -O2 -Wall -D_FORTIFY_SOURCE=2 -fstack-protector-strong -funwind-tables -fasynchronous-unwind-tables -fstack-clash-protection -g -c pq_alsa.c  -fPIC -DPIC -o .libs/pq_alsa.o
723
[   37s] libtool: compile:  gcc -DHAVE_CONFIG_H -I. -I.. -I.. -I../include -Wall -I/usr/include/libosmocore/ -I/usr/include/libosmocore/ -I/usr/include/alsa -fmessage-length=0 -grecord-gcc-switches -O2 -Wall -D_FORTIFY_SOURCE=2 -fstack-protector-strong -funwind-tables -fasynchronous-unwind-tables -fstack-clash-protection -g -c formats.c  -fPIC -DPIC -o .libs/formats.o
724
[   37s] libtool: compile:  gcc -DHAVE_CONFIG_H -I. -I.. -I.. -I../include -Wall -I/usr/include/libosmocore/ -I/usr/include/libosmocore/ -I/usr/include/alsa -fmessage-length=0 -grecord-gcc-switches -O2 -Wall -D_FORTIFY_SOURCE=2 -fstack-protector-strong -funwind-tables -fasynchronous-unwind-tables -fstack-clash-protection -g -c fmt_ti.c  -fPIC -DPIC -o .libs/fmt_ti.o
725
[   37s] /bin/sh ../libtool  --tag=CC   --mode=compile gcc -DHAVE_CONFIG_H -I. -I..   -I.. -I../include   -Wall -I/usr/include/libosmocore/ -I/usr/include/libosmocore/  -I/usr/include/alsa  -fmessage-length=0 -grecord-gcc-switches -O2 -Wall -D_FORTIFY_SOURCE=2 -fstack-protector-strong -funwind-tables -fasynchronous-unwind-tables -fstack-clash-protection -g -c -o fmt_amr.lo fmt_amr.c
726
[   37s] /bin/sh ../libtool  --tag=CC   --mode=compile gcc -DHAVE_CONFIG_H -I. -I..   -I.. -I../include   -Wall -I/usr/include/libosmocore/ -I/usr/include/libosmocore/  -I/usr/include/alsa  -fmessage-length=0 -grecord-gcc-switches -O2 -Wall -D_FORTIFY_SOURCE=2 -fstack-protector-strong -funwind-tables -fasynchronous-unwind-tables -fstack-clash-protection -g -c -o fmt_gsm.lo fmt_gsm.c
727
[   37s] libtool: compile:  gcc -DHAVE_CONFIG_H -I. -I.. -I.. -I../include -Wall -I/usr/include/libosmocore/ -I/usr/include/libosmocore/ -I/usr/include/alsa -fmessage-length=0 -grecord-gcc-switches -O2 -Wall -D_FORTIFY_SOURCE=2 -fstack-protector-strong -funwind-tables -fasynchronous-unwind-tables -fstack-clash-protection -g -c fmt_amr.c  -fPIC -DPIC -o .libs/fmt_amr.o
728
[   37s] /bin/sh ../libtool  --tag=CC   --mode=compile gcc -DHAVE_CONFIG_H -I. -I..   -I.. -I../include   -Wall -I/usr/include/libosmocore/ -I/usr/include/libosmocore/  -I/usr/include/alsa  -fmessage-length=0 -grecord-gcc-switches -O2 -Wall -D_FORTIFY_SOURCE=2 -fstack-protector-strong -funwind-tables -fasynchronous-unwind-tables -fstack-clash-protection -g -c -o fmt_hr_ref.lo fmt_hr_ref.c
729
[   37s] /bin/sh ../libtool  --tag=CC   --mode=compile gcc -DHAVE_CONFIG_H -I. -I..   -I.. -I../include   -Wall -I/usr/include/libosmocore/ -I/usr/include/libosmocore/  -I/usr/include/alsa  -fmessage-length=0 -grecord-gcc-switches -O2 -Wall -D_FORTIFY_SOURCE=2 -fstack-protector-strong -funwind-tables -fasynchronous-unwind-tables -fstack-clash-protection -g -c -o fmt_racal.lo fmt_racal.c
730
[   37s] libtool: compile:  gcc -DHAVE_CONFIG_H -I. -I.. -I.. -I../include -Wall -I/usr/include/libosmocore/ -I/usr/include/libosmocore/ -I/usr/include/alsa -fmessage-length=0 -grecord-gcc-switches -O2 -Wall -D_FORTIFY_SOURCE=2 -fstack-protector-strong -funwind-tables -fasynchronous-unwind-tables -fstack-clash-protection -g -c fmt_gsm.c  -fPIC -DPIC -o .libs/fmt_gsm.o
731
[   37s] /bin/sh ../libtool  --tag=CC   --mode=compile gcc -DHAVE_CONFIG_H -I. -I..   -I.. -I../include   -Wall -I/usr/include/libosmocore/ -I/usr/include/libosmocore/  -I/usr/include/alsa  -fmessage-length=0 -grecord-gcc-switches -O2 -Wall -D_FORTIFY_SOURCE=2 -fstack-protector-strong -funwind-tables -fasynchronous-unwind-tables -fstack-clash-protection -g -c -o fmt_rawpcm.lo fmt_rawpcm.c
732
[   37s] libtool: compile:  gcc -DHAVE_CONFIG_H -I. -I.. -I.. -I../include -Wall -I/usr/include/libosmocore/ -I/usr/include/libosmocore/ -I/usr/include/alsa -fmessage-length=0 -grecord-gcc-switches -O2 -Wall -D_FORTIFY_SOURCE=2 -fstack-protector-strong -funwind-tables -fasynchronous-unwind-tables -fstack-clash-protection -g -c fmt_hr_ref.c  -fPIC -DPIC -o .libs/fmt_hr_ref.o
733
[   37s] /bin/sh ../libtool  --tag=CC   --mode=compile gcc -DHAVE_CONFIG_H -I. -I..   -I.. -I../include   -Wall -I/usr/include/libosmocore/ -I/usr/include/libosmocore/  -I/usr/include/alsa  -fmessage-length=0 -grecord-gcc-switches -O2 -Wall -D_FORTIFY_SOURCE=2 -fstack-protector-strong -funwind-tables -fasynchronous-unwind-tables -fstack-clash-protection -g -c -o fmt_rtp_amr.lo fmt_rtp_amr.c
734
[   37s] libtool: compile:  gcc -DHAVE_CONFIG_H -I. -I.. -I.. -I../include -Wall -I/usr/include/libosmocore/ -I/usr/include/libosmocore/ -I/usr/include/alsa -fmessage-length=0 -grecord-gcc-switches -O2 -Wall -D_FORTIFY_SOURCE=2 -fstack-protector-strong -funwind-tables -fasynchronous-unwind-tables -fstack-clash-protection -g -c fmt_racal.c  -fPIC -DPIC -o .libs/fmt_racal.o
735
[   37s] libtool: compile:  gcc -DHAVE_CONFIG_H -I. -I.. -I.. -I../include -Wall -I/usr/include/libosmocore/ -I/usr/include/libosmocore/ -I/usr/include/alsa -fmessage-length=0 -grecord-gcc-switches -O2 -Wall -D_FORTIFY_SOURCE=2 -fstack-protector-strong -funwind-tables -fasynchronous-unwind-tables -fstack-clash-protection -g -c fmt_rawpcm.c  -fPIC -DPIC -o .libs/fmt_rawpcm.o
736
[   37s] /bin/sh ../libtool  --tag=CC   --mode=compile gcc -DHAVE_CONFIG_H -I. -I..   -I.. -I../include   -Wall -I/usr/include/libosmocore/ -I/usr/include/libosmocore/  -I/usr/include/alsa  -fmessage-length=0 -grecord-gcc-switches -O2 -Wall -D_FORTIFY_SOURCE=2 -fstack-protector-strong -funwind-tables -fasynchronous-unwind-tables -fstack-clash-protection -g -c -o fmt_rtp_efr.lo fmt_rtp_efr.c
737
[   37s] libtool: compile:  gcc -DHAVE_CONFIG_H -I. -I.. -I.. -I../include -Wall -I/usr/include/libosmocore/ -I/usr/include/libosmocore/ -I/usr/include/alsa -fmessage-length=0 -grecord-gcc-switches -O2 -Wall -D_FORTIFY_SOURCE=2 -fstack-protector-strong -funwind-tables -fasynchronous-unwind-tables -fstack-clash-protection -g -c fmt_rtp_amr.c  -fPIC -DPIC -o .libs/fmt_rtp_amr.o
738
[   37s] /bin/sh ../libtool  --tag=CC   --mode=compile gcc -DHAVE_CONFIG_H -I. -I..   -I.. -I../include   -Wall -I/usr/include/libosmocore/ -I/usr/include/libosmocore/  -I/usr/include/alsa  -fmessage-length=0 -grecord-gcc-switches -O2 -Wall -D_FORTIFY_SOURCE=2 -fstack-protector-strong -funwind-tables -fasynchronous-unwind-tables -fstack-clash-protection -g -c -o fmt_rtp_hr_etsi.lo fmt_rtp_hr_etsi.c
739
[   37s] libtool: compile:  gcc -DHAVE_CONFIG_H -I. -I.. -I.. -I../include -Wall -I/usr/include/libosmocore/ -I/usr/include/libosmocore/ -I/usr/include/alsa -fmessage-length=0 -grecord-gcc-switches -O2 -Wall -D_FORTIFY_SOURCE=2 -fstack-protector-strong -funwind-tables -fasynchronous-unwind-tables -fstack-clash-protection -g -c fmt_rtp_efr.c  -fPIC -DPIC -o .libs/fmt_rtp_efr.o
740
[   37s] /bin/sh ../libtool  --tag=CC   --mode=compile gcc -DHAVE_CONFIG_H -I. -I..   -I.. -I../include   -Wall -I/usr/include/libosmocore/ -I/usr/include/libosmocore/  -I/usr/include/alsa  -fmessage-length=0 -grecord-gcc-switches -O2 -Wall -D_FORTIFY_SOURCE=2 -fstack-protector-strong -funwind-tables -fasynchronous-unwind-tables -fstack-clash-protection -g -c -o fmt_rtp_hr_ietf.lo fmt_rtp_hr_ietf.c
741
[   37s] /bin/sh ../libtool  --tag=CC   --mode=compile gcc -DHAVE_CONFIG_H -I. -I..   -I.. -I../include   -Wall -I/usr/include/libosmocore/ -I/usr/include/libosmocore/  -I/usr/include/alsa  -fmessage-length=0 -grecord-gcc-switches -O2 -Wall -D_FORTIFY_SOURCE=2 -fstack-protector-strong -funwind-tables -fasynchronous-unwind-tables -fstack-clash-protection -g -c -o fmt_amr_opencore.lo fmt_amr_opencore.c
742
[   37s] libtool: compile:  gcc -DHAVE_CONFIG_H -I. -I.. -I.. -I../include -Wall -I/usr/include/libosmocore/ -I/usr/include/libosmocore/ -I/usr/include/alsa -fmessage-length=0 -grecord-gcc-switches -O2 -Wall -D_FORTIFY_SOURCE=2 -fstack-protector-strong -funwind-tables -fasynchronous-unwind-tables -fstack-clash-protection -g -c fmt_rtp_hr_etsi.c  -fPIC -DPIC -o .libs/fmt_rtp_hr_etsi.o
743
[   38s] /bin/sh ../libtool  --tag=CC   --mode=compile gcc -DHAVE_CONFIG_H -I. -I..   -I.. -I../include   -Wall -I/usr/include/libosmocore/ -I/usr/include/libosmocore/  -I/usr/include/alsa  -fmessage-length=0 -grecord-gcc-switches -O2 -Wall -D_FORTIFY_SOURCE=2 -fstack-protector-strong -funwind-tables -fasynchronous-unwind-tables -fstack-clash-protection -g -c -o codecs.lo codecs.c
744
[   38s] /bin/sh ../libtool  --tag=CC   --mode=compile gcc -DHAVE_CONFIG_H -I. -I..   -I.. -I../include   -Wall -I/usr/include/libosmocore/ -I/usr/include/libosmocore/  -I/usr/include/alsa  -fmessage-length=0 -grecord-gcc-switches -O2 -Wall -D_FORTIFY_SOURCE=2 -fstack-protector-strong -funwind-tables -fasynchronous-unwind-tables -fstack-clash-protection -g -c -o codec_pcm.lo codec_pcm.c
745
[   38s] libtool: compile:  gcc -DHAVE_CONFIG_H -I. -I.. -I.. -I../include -Wall -I/usr/include/libosmocore/ -I/usr/include/libosmocore/ -I/usr/include/alsa -fmessage-length=0 -grecord-gcc-switches -O2 -Wall -D_FORTIFY_SOURCE=2 -fstack-protector-strong -funwind-tables -fasynchronous-unwind-tables -fstack-clash-protection -g -c fmt_rtp_hr_ietf.c  -fPIC -DPIC -o .libs/fmt_rtp_hr_ietf.o
746
[   38s] libtool: compile:  gcc -DHAVE_CONFIG_H -I. -I.. -I.. -I../include -Wall -I/usr/include/libosmocore/ -I/usr/include/libosmocore/ -I/usr/include/alsa -fmessage-length=0 -grecord-gcc-switches -O2 -Wall -D_FORTIFY_SOURCE=2 -fstack-protector-strong -funwind-tables -fasynchronous-unwind-tables -fstack-clash-protection -g -c fmt_amr_opencore.c  -fPIC -DPIC -o .libs/fmt_amr_opencore.o
747
[   38s] /bin/sh ../libtool  --tag=CC   --mode=compile gcc -DHAVE_CONFIG_H -I. -I..   -I.. -I../include   -Wall -I/usr/include/libosmocore/ -I/usr/include/libosmocore/  -I/usr/include/alsa  -fmessage-length=0 -grecord-gcc-switches -O2 -Wall -D_FORTIFY_SOURCE=2 -fstack-protector-strong -funwind-tables -fasynchronous-unwind-tables -fstack-clash-protection -g -c -o codec_hr.lo codec_hr.c
748
[   38s] /bin/sh ../libtool  --tag=CC   --mode=compile gcc -DHAVE_CONFIG_H -I. -I..   -I.. -I../include   -Wall -I/usr/include/libosmocore/ -I/usr/include/libosmocore/  -I/usr/include/alsa  -fmessage-length=0 -grecord-gcc-switches -O2 -Wall -D_FORTIFY_SOURCE=2 -fstack-protector-strong -funwind-tables -fasynchronous-unwind-tables -fstack-clash-protection -g -c -o codec_fr.lo codec_fr.c
749
[   38s] libtool: compile:  gcc -DHAVE_CONFIG_H -I. -I.. -I.. -I../include -Wall -I/usr/include/libosmocore/ -I/usr/include/libosmocore/ -I/usr/include/alsa -fmessage-length=0 -grecord-gcc-switches -O2 -Wall -D_FORTIFY_SOURCE=2 -fstack-protector-strong -funwind-tables -fasynchronous-unwind-tables -fstack-clash-protection -g -c codecs.c  -fPIC -DPIC -o .libs/codecs.o
750
[   38s] libtool: compile:  gcc -DHAVE_CONFIG_H -I. -I.. -I.. -I../include -Wall -I/usr/include/libosmocore/ -I/usr/include/libosmocore/ -I/usr/include/alsa -fmessage-length=0 -grecord-gcc-switches -O2 -Wall -D_FORTIFY_SOURCE=2 -fstack-protector-strong -funwind-tables -fasynchronous-unwind-tables -fstack-clash-protection -g -c codec_pcm.c  -fPIC -DPIC -o .libs/codec_pcm.o
751
[   38s] /bin/sh ../libtool  --tag=CC   --mode=compile gcc -DHAVE_CONFIG_H -I. -I..   -I.. -I../include   -Wall -I/usr/include/libosmocore/ -I/usr/include/libosmocore/  -I/usr/include/alsa  -fmessage-length=0 -grecord-gcc-switches -O2 -Wall -D_FORTIFY_SOURCE=2 -fstack-protector-strong -funwind-tables -fasynchronous-unwind-tables -fstack-clash-protection -g -c -o codec_efr.lo codec_efr.c
752
[   38s] /bin/sh ../libtool  --tag=CC   --mode=compile gcc -DHAVE_CONFIG_H -I. -I..   -I.. -I../include   -Wall -I/usr/include/libosmocore/ -I/usr/include/libosmocore/  -I/usr/include/alsa  -fmessage-length=0 -grecord-gcc-switches -O2 -Wall -D_FORTIFY_SOURCE=2 -fstack-protector-strong -funwind-tables -fasynchronous-unwind-tables -fstack-clash-protection -g -c -o codec_amr.lo codec_amr.c
753
[   38s] libtool: compile:  gcc -DHAVE_CONFIG_H -I. -I.. -I.. -I../include -Wall -I/usr/include/libosmocore/ -I/usr/include/libosmocore/ -I/usr/include/alsa -fmessage-length=0 -grecord-gcc-switches -O2 -Wall -D_FORTIFY_SOURCE=2 -fstack-protector-strong -funwind-tables -fasynchronous-unwind-tables -fstack-clash-protection -g -c codec_hr.c  -fPIC -DPIC -o .libs/codec_hr.o
754
[   38s] libtool: compile:  gcc -DHAVE_CONFIG_H -I. -I.. -I.. -I../include -Wall -I/usr/include/libosmocore/ -I/usr/include/libosmocore/ -I/usr/include/alsa -fmessage-length=0 -grecord-gcc-switches -O2 -Wall -D_FORTIFY_SOURCE=2 -fstack-protector-strong -funwind-tables -fasynchronous-unwind-tables -fstack-clash-protection -g -c codec_fr.c  -fPIC -DPIC -o .libs/codec_fr.o
755
[   38s] libtool: compile:  gcc -DHAVE_CONFIG_H -I. -I.. -I.. -I../include -Wall -I/usr/include/libosmocore/ -I/usr/include/libosmocore/ -I/usr/include/alsa -fmessage-length=0 -grecord-gcc-switches -O2 -Wall -D_FORTIFY_SOURCE=2 -fstack-protector-strong -funwind-tables -fasynchronous-unwind-tables -fstack-clash-protection -g -c codec_efr.c  -fPIC -DPIC -o .libs/codec_efr.o
756
[   38s] libtool: compile:  gcc -DHAVE_CONFIG_H -I. -I.. -I.. -I../include -Wall -I/usr/include/libosmocore/ -I/usr/include/libosmocore/ -I/usr/include/alsa -fmessage-length=0 -grecord-gcc-switches -O2 -Wall -D_FORTIFY_SOURCE=2 -fstack-protector-strong -funwind-tables -fasynchronous-unwind-tables -fstack-clash-protection -g -c codec_amr.c  -fPIC -DPIC -o .libs/codec_amr.o
757
[   38s] /bin/sh ../libtool  --tag=CC   --mode=compile gcc -DHAVE_CONFIG_H -I. -I..   -I.. -I../include   -Wall -I/usr/include/libosmocore/ -I/usr/include/libosmocore/  -I/usr/include/alsa  -fmessage-length=0 -grecord-gcc-switches -O2 -Wall -D_FORTIFY_SOURCE=2 -fstack-protector-strong -funwind-tables -fasynchronous-unwind-tables -fstack-clash-protection -g -c -o benchmark.lo benchmark.c
758
[   38s] /bin/sh ../libtool  --tag=CC   --mode=compile gcc -DHAVE_CONFIG_H -I. -I..   -I.. -I../include   -Wall -I/usr/include/libosmocore/ -I/usr/include/libosmocore/  -I/usr/include/alsa  -fmessage-length=0 -grecord-gcc-switches -O2 -Wall -D_FORTIFY_SOURCE=2 -fstack-protector-strong -funwind-tables -fasynchronous-unwind-tables -fstack-clash-protection -g -c -o common.lo common.c
759
[   38s] gcc -DHAVE_CONFIG_H -I. -I..   -I.. -I../include   -Wall -I/usr/include/libosmocore/ -I/usr/include/libosmocore/  -I/usr/include/alsa  -fmessage-length=0 -grecord-gcc-switches -O2 -Wall -D_FORTIFY_SOURCE=2 -fstack-protector-strong -funwind-tables -fasynchronous-unwind-tables -fstack-clash-protection -g -c -o app_osmo_gapk.o app_osmo_gapk.c
760
[   38s] libtool: compile:  gcc -DHAVE_CONFIG_H -I. -I.. -I.. -I../include -Wall -I/usr/include/libosmocore/ -I/usr/include/libosmocore/ -I/usr/include/alsa -fmessage-length=0 -grecord-gcc-switches -O2 -Wall -D_FORTIFY_SOURCE=2 -fstack-protector-strong -funwind-tables -fasynchronous-unwind-tables -fstack-clash-protection -g -c common.c  -fPIC -DPIC -o .libs/common.o
761
[   38s] libtool: compile:  gcc -DHAVE_CONFIG_H -I. -I.. -I.. -I../include -Wall -I/usr/include/libosmocore/ -I/usr/include/libosmocore/ -I/usr/include/alsa -fmessage-length=0 -grecord-gcc-switches -O2 -Wall -D_FORTIFY_SOURCE=2 -fstack-protector-strong -funwind-tables -fasynchronous-unwind-tables -fstack-clash-protection -g -c benchmark.c  -fPIC -DPIC -o .libs/benchmark.o
762
[   38s] /bin/sh ../libtool  --tag=CC   --mode=link gcc -Wall -I/usr/include/libosmocore/ -I/usr/include/libosmocore/  -I/usr/include/alsa  -fmessage-length=0 -grecord-gcc-switches -O2 -Wall -D_FORTIFY_SOURCE=2 -fstack-protector-strong -funwind-tables -fasynchronous-unwind-tables -fstack-clash-protection -g -ltalloc -losmocore -losmocodec -lopencore-amrnb -lgsm -lasound -Wl,--version-script=./libosmogapk.map -version-info 0:0:0 -no-undefined   -o libosmogapk.la -rpath /usr/lib64 procqueue.lo pq_format.lo pq_codec.lo pq_file.lo pq_alsa.lo pq_rtp.lo formats.lo fmt_ti.lo fmt_amr.lo fmt_gsm.lo fmt_hr_ref.lo fmt_racal.lo fmt_rawpcm.lo fmt_rtp_amr.lo fmt_rtp_efr.lo fmt_rtp_hr_etsi.lo fmt_rtp_hr_ietf.lo fmt_amr_opencore.lo codecs.lo codec_pcm.lo codec_hr.lo codec_fr.lo codec_efr.lo codec_amr.lo benchmark.lo common.lo ../libgsmhr/libgsmhr.la 
763
[   38s] libtool: link: gcc -shared  -fPIC -DPIC  .libs/procqueue.o .libs/pq_format.o .libs/pq_codec.o .libs/pq_file.o .libs/pq_alsa.o .libs/pq_rtp.o .libs/formats.o .libs/fmt_ti.o .libs/fmt_amr.o .libs/fmt_gsm.o .libs/fmt_hr_ref.o .libs/fmt_racal.o .libs/fmt_rawpcm.o .libs/fmt_rtp_amr.o .libs/fmt_rtp_efr.o .libs/fmt_rtp_hr_etsi.o .libs/fmt_rtp_hr_ietf.o .libs/fmt_amr_opencore.o .libs/codecs.o .libs/codec_pcm.o .libs/codec_hr.o .libs/codec_fr.o .libs/codec_efr.o .libs/codec_amr.o .libs/benchmark.o .libs/common.o   -Wl,-rpath -Wl,/home/abuild/rpmbuild/BUILD/gapk-0.4.60/libgsmhr/.libs -Wl,-rpath -Wl,/usr/lib64 -ltalloc -losmocore -losmocodec -lopencore-amrnb -lgsm -lasound ../libgsmhr/.libs/libgsmhr.so -ldl  -grecord-gcc-switches -O2 -fstack-protector-strong -g -Wl,--version-script=./libosmogapk.map   -Wl,-soname -Wl,libosmogapk.so.0 -o .libs/libosmogapk.so.0.0.0
764
[   38s] libtool: link: (cd ".libs" && rm -f "libosmogapk.so.0" && ln -s "libosmogapk.so.0.0.0" "libosmogapk.so.0")
765
[   38s] libtool: link: (cd ".libs" && rm -f "libosmogapk.so" && ln -s "libosmogapk.so.0.0.0" "libosmogapk.so")
766
[   38s] libtool: link: ( cd ".libs" && rm -f "libosmogapk.la" && ln -s "../libosmogapk.la" "libosmogapk.la" )
767
[   38s] /bin/sh ../libtool  --tag=CC   --mode=link gcc -Wall -I/usr/include/libosmocore/ -I/usr/include/libosmocore/  -I/usr/include/alsa  -fmessage-length=0 -grecord-gcc-switches -O2 -Wall -D_FORTIFY_SOURCE=2 -fstack-protector-strong -funwind-tables -fasynchronous-unwind-tables -fstack-clash-protection -g -ltalloc -losmocore   -o osmo-gapk app_osmo_gapk.o libosmogapk.la  
768
[   38s] libtool: link: gcc -Wall -I/usr/include/libosmocore/ -I/usr/include/libosmocore/ -I/usr/include/alsa -fmessage-length=0 -grecord-gcc-switches -O2 -Wall -D_FORTIFY_SOURCE=2 -fstack-protector-strong -funwind-tables -fasynchronous-unwind-tables -fstack-clash-protection -g -o .libs/osmo-gapk app_osmo_gapk.o  ./.libs/libosmogapk.so -ltalloc -losmocore -losmocodec -lopencore-amrnb -lgsm -lasound /home/abuild/rpmbuild/BUILD/gapk-0.4.60/libgsmhr/.libs/libgsmhr.so -ldl -Wl,-rpath -Wl,/usr/lib64
769
[   38s] make[2]: Leaving directory '/home/abuild/rpmbuild/BUILD/gapk-0.4.60/src'
770
[   38s] Making all in tests
771
[   38s] make[2]: Entering directory '/home/abuild/rpmbuild/BUILD/gapk-0.4.60/tests'
772
[   38s] make[2]: Nothing to be done for 'all'.
773
[   38s] make[2]: Leaving directory '/home/abuild/rpmbuild/BUILD/gapk-0.4.60/tests'
774
[   38s] make[2]: Entering directory '/home/abuild/rpmbuild/BUILD/gapk-0.4.60'
775
[   38s] make[2]: Leaving directory '/home/abuild/rpmbuild/BUILD/gapk-0.4.60'
776
[   38s] make[1]: Leaving directory '/home/abuild/rpmbuild/BUILD/gapk-0.4.60'
777
[   38s] + exit 0
778
[   38s] Executing(%install): /bin/sh -e /var/tmp/rpm-tmp.layu1X
779
[   38s] + umask 022
780
[   38s] + cd /home/abuild/rpmbuild/BUILD
781
[   38s] + cd gapk-0.4.60
782
[   38s] + make install DESTDIR=/home/abuild/rpmbuild/BUILDROOT/gapk-0.4.60-0.x86_64
783
[   38s] Making install in include
784
[   38s] make[1]: Entering directory '/home/abuild/rpmbuild/BUILD/gapk-0.4.60/include'
785
[   38s] Making install in gsmhr
786
[   38s] make[2]: Entering directory '/home/abuild/rpmbuild/BUILD/gapk-0.4.60/include/gsmhr'
787
[   38s] make[3]: Entering directory '/home/abuild/rpmbuild/BUILD/gapk-0.4.60/include/gsmhr'
788
[   38s] make[3]: Nothing to be done for 'install-exec-am'.
789
[   38s] make[3]: Nothing to be done for 'install-data-am'.
790
[   38s] make[3]: Leaving directory '/home/abuild/rpmbuild/BUILD/gapk-0.4.60/include/gsmhr'
791
[   38s] make[2]: Leaving directory '/home/abuild/rpmbuild/BUILD/gapk-0.4.60/include/gsmhr'
792
[   38s] make[2]: Entering directory '/home/abuild/rpmbuild/BUILD/gapk-0.4.60/include'
793
[   38s] make[3]: Entering directory '/home/abuild/rpmbuild/BUILD/gapk-0.4.60/include'
794
[   38s] make[3]: Nothing to be done for 'install-exec-am'.
795
[   38s]  /usr/bin/mkdir -p '/home/abuild/rpmbuild/BUILDROOT/gapk-0.4.60-0.x86_64/usr/include'
796
[   38s]  /usr/bin/mkdir -p '/home/abuild/rpmbuild/BUILDROOT/gapk-0.4.60-0.x86_64/usr/include/osmocom/gapk'
797
[   38s]  /usr/bin/install -c -m 644  osmocom/gapk/get_cycles.h osmocom/gapk/benchmark.h osmocom/gapk/procqueue.h osmocom/gapk/formats.h osmocom/gapk/codecs.h osmocom/gapk/common.h '/home/abuild/rpmbuild/BUILDROOT/gapk-0.4.60-0.x86_64/usr/include/osmocom/gapk'
798
[   38s] make[3]: Leaving directory '/home/abuild/rpmbuild/BUILD/gapk-0.4.60/include'
799
[   38s] make[2]: Leaving directory '/home/abuild/rpmbuild/BUILD/gapk-0.4.60/include'
800
[   38s] make[1]: Leaving directory '/home/abuild/rpmbuild/BUILD/gapk-0.4.60/include'
801
[   38s] Making install in libgsmhr
802
[   38s] make[1]: Entering directory '/home/abuild/rpmbuild/BUILD/gapk-0.4.60/libgsmhr'
803
[   38s] make[2]: Entering directory '/home/abuild/rpmbuild/BUILD/gapk-0.4.60/libgsmhr'
804
[   38s]  /usr/bin/mkdir -p '/home/abuild/rpmbuild/BUILDROOT/gapk-0.4.60-0.x86_64/usr/lib64'
805
[   38s]  /bin/sh ../libtool   --mode=install /usr/bin/install -c   libgsmhr.la '/home/abuild/rpmbuild/BUILDROOT/gapk-0.4.60-0.x86_64/usr/lib64'
806
[   38s] libtool: install: /usr/bin/install -c .libs/libgsmhr.so.0.0.0 /home/abuild/rpmbuild/BUILDROOT/gapk-0.4.60-0.x86_64/usr/lib64/libgsmhr.so.0.0.0
807
[   38s] libtool: install: (cd /home/abuild/rpmbuild/BUILDROOT/gapk-0.4.60-0.x86_64/usr/lib64 && { ln -s -f libgsmhr.so.0.0.0 libgsmhr.so.0 || { rm -f libgsmhr.so.0 && ln -s libgsmhr.so.0.0.0 libgsmhr.so.0; }; })
808
[   38s] libtool: install: (cd /home/abuild/rpmbuild/BUILDROOT/gapk-0.4.60-0.x86_64/usr/lib64 && { ln -s -f libgsmhr.so.0.0.0 libgsmhr.so || { rm -f libgsmhr.so && ln -s libgsmhr.so.0.0.0 libgsmhr.so; }; })
809
[   38s] libtool: install: /usr/bin/install -c .libs/libgsmhr.lai /home/abuild/rpmbuild/BUILDROOT/gapk-0.4.60-0.x86_64/usr/lib64/libgsmhr.la
810
[   38s] libtool: warning: remember to run 'libtool --finish /usr/lib64'
811
[   38s] make[2]: Nothing to be done for 'install-data-am'.
812
[   38s] make[2]: Leaving directory '/home/abuild/rpmbuild/BUILD/gapk-0.4.60/libgsmhr'
813
[   38s] make[1]: Leaving directory '/home/abuild/rpmbuild/BUILD/gapk-0.4.60/libgsmhr'
814
[   38s] Making install in src
815
[   38s] make[1]: Entering directory '/home/abuild/rpmbuild/BUILD/gapk-0.4.60/src'
816
[   38s] make[2]: Entering directory '/home/abuild/rpmbuild/BUILD/gapk-0.4.60/src'
817
[   38s]  /usr/bin/mkdir -p '/home/abuild/rpmbuild/BUILDROOT/gapk-0.4.60-0.x86_64/usr/lib64'
818
[   38s]  /bin/sh ../libtool   --mode=install /usr/bin/install -c   libosmogapk.la '/home/abuild/rpmbuild/BUILDROOT/gapk-0.4.60-0.x86_64/usr/lib64'
819
[   38s] libtool: warning: relinking 'libosmogapk.la'
820
[   38s] libtool: install: (cd /home/abuild/rpmbuild/BUILD/gapk-0.4.60/src; /bin/sh "/home/abuild/rpmbuild/BUILD/gapk-0.4.60/libtool"  --tag CC --mode=relink gcc -Wall -I/usr/include/libosmocore/ -I/usr/include/libosmocore/ -I/usr/include/alsa -fmessage-length=0 -grecord-gcc-switches -O2 -Wall -D_FORTIFY_SOURCE=2 -fstack-protector-strong -funwind-tables -fasynchronous-unwind-tables -fstack-clash-protection -g -ltalloc -losmocore -losmocodec -lopencore-amrnb -lgsm -lasound -Wl,--version-script=./libosmogapk.map -version-info 0:0:0 -no-undefined -o libosmogapk.la -rpath /usr/lib64 procqueue.lo pq_format.lo pq_codec.lo pq_file.lo pq_alsa.lo pq_rtp.lo formats.lo fmt_ti.lo fmt_amr.lo fmt_gsm.lo fmt_hr_ref.lo fmt_racal.lo fmt_rawpcm.lo fmt_rtp_amr.lo fmt_rtp_efr.lo fmt_rtp_hr_etsi.lo fmt_rtp_hr_ietf.lo fmt_amr_opencore.lo codecs.lo codec_pcm.lo codec_hr.lo codec_fr.lo codec_efr.lo codec_amr.lo benchmark.lo common.lo ../libgsmhr/libgsmhr.la -inst-prefix-dir /home/abuild/rpmbuild/BUILDROOT/gapk-0.4.60-0.x86_64)
821
[   39s] libtool: relink: gcc -shared  -fPIC -DPIC  .libs/procqueue.o .libs/pq_format.o .libs/pq_codec.o .libs/pq_file.o .libs/pq_alsa.o .libs/pq_rtp.o .libs/formats.o .libs/fmt_ti.o .libs/fmt_amr.o .libs/fmt_gsm.o .libs/fmt_hr_ref.o .libs/fmt_racal.o .libs/fmt_rawpcm.o .libs/fmt_rtp_amr.o .libs/fmt_rtp_efr.o .libs/fmt_rtp_hr_etsi.o .libs/fmt_rtp_hr_ietf.o .libs/fmt_amr_opencore.o .libs/codecs.o .libs/codec_pcm.o .libs/codec_hr.o .libs/codec_fr.o .libs/codec_efr.o .libs/codec_amr.o .libs/benchmark.o .libs/common.o   -Wl,-rpath -Wl,/usr/lib64 -ltalloc -losmocore -losmocodec -lopencore-amrnb -lgsm -lasound -L/home/abuild/rpmbuild/BUILDROOT/gapk-0.4.60-0.x86_64/usr/lib64 -L/usr/lib64 -lgsmhr -ldl  -grecord-gcc-switches -O2 -fstack-protector-strong -g -Wl,--version-script=./libosmogapk.map   -Wl,-soname -Wl,libosmogapk.so.0 -o .libs/libosmogapk.so.0.0.0
822
[   39s] libtool: install: /usr/bin/install -c .libs/libosmogapk.so.0.0.0T /home/abuild/rpmbuild/BUILDROOT/gapk-0.4.60-0.x86_64/usr/lib64/libosmogapk.so.0.0.0
823
[   39s] libtool: install: (cd /home/abuild/rpmbuild/BUILDROOT/gapk-0.4.60-0.x86_64/usr/lib64 && { ln -s -f libosmogapk.so.0.0.0 libosmogapk.so.0 || { rm -f libosmogapk.so.0 && ln -s libosmogapk.so.0.0.0 libosmogapk.so.0; }; })
824
[   39s] libtool: install: (cd /home/abuild/rpmbuild/BUILDROOT/gapk-0.4.60-0.x86_64/usr/lib64 && { ln -s -f libosmogapk.so.0.0.0 libosmogapk.so || { rm -f libosmogapk.so && ln -s libosmogapk.so.0.0.0 libosmogapk.so; }; })
825
[   39s] libtool: install: /usr/bin/install -c .libs/libosmogapk.lai /home/abuild/rpmbuild/BUILDROOT/gapk-0.4.60-0.x86_64/usr/lib64/libosmogapk.la
826
[   39s] libtool: warning: remember to run 'libtool --finish /usr/lib64'
827
[   39s]  /usr/bin/mkdir -p '/home/abuild/rpmbuild/BUILDROOT/gapk-0.4.60-0.x86_64/usr/bin'
828
[   39s]   /bin/sh ../libtool   --mode=install /usr/bin/install -c osmo-gapk '/home/abuild/rpmbuild/BUILDROOT/gapk-0.4.60-0.x86_64/usr/bin'
829
[   39s] libtool: warning: 'libosmogapk.la' has not been installed in '/usr/lib64'
830
[   39s] libtool: warning: '/home/abuild/rpmbuild/BUILD/gapk-0.4.60/libgsmhr/libgsmhr.la' has not been installed in '/usr/lib64'
831
[   39s] libtool: install: /usr/bin/install -c .libs/osmo-gapk /home/abuild/rpmbuild/BUILDROOT/gapk-0.4.60-0.x86_64/usr/bin/osmo-gapk
832
[   39s] make[2]: Nothing to be done for 'install-data-am'.
833
[   39s] make[2]: Leaving directory '/home/abuild/rpmbuild/BUILD/gapk-0.4.60/src'
834
[   39s] make[1]: Leaving directory '/home/abuild/rpmbuild/BUILD/gapk-0.4.60/src'
835
[   39s] Making install in tests
836
[   39s] make[1]: Entering directory '/home/abuild/rpmbuild/BUILD/gapk-0.4.60/tests'
837
[   39s] make[2]: Entering directory '/home/abuild/rpmbuild/BUILD/gapk-0.4.60/tests'
838
[   39s] make[2]: Nothing to be done for 'install-exec-am'.
839
[   39s] make[2]: Nothing to be done for 'install-data-am'.
840
[   39s] make[2]: Leaving directory '/home/abuild/rpmbuild/BUILD/gapk-0.4.60/tests'
841
[   39s] make[1]: Leaving directory '/home/abuild/rpmbuild/BUILD/gapk-0.4.60/tests'
842
[   39s] make[1]: Entering directory '/home/abuild/rpmbuild/BUILD/gapk-0.4.60'
843
[   39s] make[2]: Entering directory '/home/abuild/rpmbuild/BUILD/gapk-0.4.60'
844
[   39s] make[2]: Nothing to be done for 'install-exec-am'.
845
[   39s]  /usr/bin/mkdir -p '/home/abuild/rpmbuild/BUILDROOT/gapk-0.4.60-0.x86_64/usr/lib64/pkgconfig'
846
[   39s]  /usr/bin/install -c -m 644 libosmogapk.pc '/home/abuild/rpmbuild/BUILDROOT/gapk-0.4.60-0.x86_64/usr/lib64/pkgconfig'
847
[   39s] make[2]: Leaving directory '/home/abuild/rpmbuild/BUILD/gapk-0.4.60'
848
[   39s] make[1]: Leaving directory '/home/abuild/rpmbuild/BUILD/gapk-0.4.60'
849
[   39s] + rm -f /home/abuild/rpmbuild/BUILDROOT/gapk-0.4.60-0.x86_64//usr/lib64/libgsmhr.la /home/abuild/rpmbuild/BUILDROOT/gapk-0.4.60-0.x86_64//usr/lib64/libosmogapk.la
850
[   39s] + /usr/lib/rpm/find-debuginfo.sh -j4 --build-id-seed 0.4.60-0 --unique-debug-suffix -0.4.60-0.x86_64 --unique-debug-src-base gapk-0.4.60-0.x86_64 --run-dwz --dwz-low-mem-die-limit 10000000 --dwz-max-die-limit 50000000 -S debugsourcefiles.list /home/abuild/rpmbuild/BUILD/gapk-0.4.60
851
[   39s] extracting debug info from /home/abuild/rpmbuild/BUILDROOT/gapk-0.4.60-0.x86_64/usr/lib64/libgsmhr.so.0.0.0
852
[   39s] extracting debug info from /home/abuild/rpmbuild/BUILDROOT/gapk-0.4.60-0.x86_64/usr/lib64/libosmogapk.so.0.0.0
853
[   39s] extracting debug info from /home/abuild/rpmbuild/BUILDROOT/gapk-0.4.60-0.x86_64/usr/bin/osmo-gapk
854
[   39s] /usr/lib/rpm/sepdebugcrcfix: Updated 3 CRC32s, 0 CRC32s did match.
855
[   39s] 2440 blocks
856
[   39s] + /usr/lib/rpm/brp-compress
857
[   39s] + /usr/lib/rpm/brp-suse
858
[   39s] calling /usr/lib/rpm/brp-suse.d/brp-05-permissions
859
[   39s] setting / to root:root 0755. (wrong owner/group abuild:abuild)
860
[   39s] setting /usr/ to root:root 0755. (wrong owner/group abuild:abuild)
861
[   39s] calling /usr/lib/rpm/brp-suse.d/brp-15-strip-debug
862
[   39s] calling /usr/lib/rpm/brp-suse.d/brp-25-symlink
863
[   39s] calling /usr/lib/rpm/brp-suse.d/brp-30-desktop
864
[   39s] WARNING: '/usr/lib/rpm/brp-desktop.data/suse-screensavers.menu' does not exist
865
[   39s] WARNING: '/usr/lib/rpm/brp-desktop.data/applications-kmenuedit.menu' does not exist
866
[   39s] WARNING: '/usr/lib/rpm/brp-desktop.data/custom.menu' does not exist
867
[   39s] calling /usr/lib/rpm/brp-suse.d/brp-35-rpath
868
[   39s] calling /usr/lib/rpm/brp-suse.d/brp-40-rootfs
869
[   39s] calling /usr/lib/rpm/brp-suse.d/brp-45-tcl
870
[   39s] calling /usr/lib/rpm/brp-suse.d/brp-50-check-python
871
[   39s] calling /usr/lib/rpm/brp-suse.d/brp-55-boot-scripts
872
[   39s] calling /usr/lib/rpm/brp-suse.d/brp-60-hook
873
[   39s] calling /usr/lib/rpm/brp-suse.d/brp-65-lib64-linux
874
[   40s] calling /usr/lib/rpm/brp-suse.d/brp-72-extract-appdata
875
[   40s] Executing(%check): /bin/sh -e /var/tmp/rpm-tmp.cvPbtR
876
[   40s] + umask 022
877
[   40s] + cd /home/abuild/rpmbuild/BUILD
878
[   40s] + cd gapk-0.4.60
879
[   40s] + make -j4 check
880
[   40s] Making check in include
881
[   40s] make[1]: Entering directory '/home/abuild/rpmbuild/BUILD/gapk-0.4.60/include'
882
[   40s] Making check in gsmhr
883
[   40s] make[2]: Entering directory '/home/abuild/rpmbuild/BUILD/gapk-0.4.60/include/gsmhr'
884
[   40s] make[2]: Nothing to be done for 'check'.
885
[   40s] make[2]: Leaving directory '/home/abuild/rpmbuild/BUILD/gapk-0.4.60/include/gsmhr'
886
[   40s] make[2]: Entering directory '/home/abuild/rpmbuild/BUILD/gapk-0.4.60/include'
887
[   40s] make[2]: Nothing to be done for 'check-am'.
888
[   40s] make[2]: Leaving directory '/home/abuild/rpmbuild/BUILD/gapk-0.4.60/include'
889
[   40s] make[1]: Leaving directory '/home/abuild/rpmbuild/BUILD/gapk-0.4.60/include'
890
[   40s] Making check in libgsmhr
891
[   40s] make[1]: Entering directory '/home/abuild/rpmbuild/BUILD/gapk-0.4.60/libgsmhr'
892
[   40s] make[1]: Nothing to be done for 'check'.
893
[   40s] make[1]: Leaving directory '/home/abuild/rpmbuild/BUILD/gapk-0.4.60/libgsmhr'
894
[   40s] Making check in src
895
[   40s] make[1]: Entering directory '/home/abuild/rpmbuild/BUILD/gapk-0.4.60/src'
896
[   40s] make[1]: Nothing to be done for 'check'.
897
[   40s] make[1]: Leaving directory '/home/abuild/rpmbuild/BUILD/gapk-0.4.60/src'
898
[   40s] Making check in tests
899
[   40s] make[1]: Entering directory '/home/abuild/rpmbuild/BUILD/gapk-0.4.60/tests'
900
[   40s] make  procqueue/pq_test io/pq_file_test io/pq_rtp_test
901
[   40s] make[2]: Entering directory '/home/abuild/rpmbuild/BUILD/gapk-0.4.60/tests'
902
[   40s]   CC       io/pq_file_test.o
903
[   40s]   CC       io/pq_rtp_test.o
904
[   40s]   CC       procqueue/pq_test.o
905
[   40s]   CCLD     io/pq_file_test
906
[   40s]   CCLD     io/pq_rtp_test
907
[   40s]   CCLD     procqueue/pq_test
908
[   40s] make[2]: Leaving directory '/home/abuild/rpmbuild/BUILD/gapk-0.4.60/tests'
909
[   40s] make  check-local
910
[   40s] make[2]: Entering directory '/home/abuild/rpmbuild/BUILD/gapk-0.4.60/tests'
911
[   40s] :;{ \
912
[   40s] 		echo '# Signature of the current package.' && \
913
[   40s] 		echo 'm4_define([AT_PACKAGE_NAME],' && \
914
[   40s] 		echo '  [gapk])' && \
915
[   40s] 		echo 'm4_define([AT_PACKAGE_TARNAME],' && \
916
[   40s] 		echo '  [gapk])' && \
917
[   40s] 		echo 'm4_define([AT_PACKAGE_VERSION],' && \
918
[   40s] 		echo '  [0.4.60])' && \
919
[   40s] 		echo 'm4_define([AT_PACKAGE_STRING],' && \
920
[   40s] 		echo '  [gapk 0.4.60])' && \
921
[   40s] 		echo 'm4_define([AT_PACKAGE_BUGREPORT],' && \
922
[   40s] 		echo '  [openbsc@lists.osmocom.org])'; \
923
[   40s] 		echo 'm4_define([AT_PACKAGE_URL],' && \
924
[   40s] 		echo '  [])'; \
925
[   40s] 		} >'./package.m4'
926
[   40s] /bin/sh ../missing --run autom4te --language=autotest -I '.' -o testsuite.tmp testsuite.at
927
[   40s] mv testsuite.tmp testsuite
928
[   40s] /bin/sh './testsuite' 
929
[   40s] ## ----------------------- ##
930
[   40s] ## gapk 0.4.60 test suite. ##
931
[   40s] ## ----------------------- ##
932
[   40s] 
933
[   40s] Regression tests.
934
[   40s] 
935
[   40s]   1: procqueue                                       ok
936
[   40s]   2: io/pq_file                                      ok
937
[   40s]   3: io/pq_rtp                                       ok
938
[   41s]   4: conv/enc/amr_efr                                ok
939
[   41s]   5: conv/enc/gsm                                    ok
940
[   41s]   6: conv/enc/racal_hr                               FAILED (testsuite.at:52)
941
[   41s]   7: conv/enc/racal_fr                               ok
942
[   41s]   8: conv/enc/racal_efr                              ok
943
[   41s]   9: conv/enc/ti_hr                                  FAILED (testsuite.at:85)
944
[   41s]  10: conv/enc/ti_fr                                  ok
945
[   41s]  11: conv/enc/ti_efr                                 ok
946
[   41s]  12: conv/enc/rtp_efr                                ok
947
[   42s]  13: conv/enc/rtp_hr_etsi                            FAILED (testsuite.at:129)
948
[   42s]  14: conv/enc/rtp_hr_ietf                            FAILED (testsuite.at:140)
949
[   42s]  15: conv/dec/amr_efr                                ok
950
[   42s]  16: conv/dec/gsm                                    ok
951
[   42s]  17: conv/dec/racal_hr                               ok
952
[   42s]  18: conv/dec/racal_fr                               ok
953
[   42s]  19: conv/dec/racal_efr                              ok
954
[   42s]  20: conv/dec/ti_hr                                  ok
955
[   42s]  21: conv/dec/ti_fr                                  ok
956
[   42s]  22: conv/dec/ti_efr                                 FAILED (testsuite.at:228)
957
[   43s]  23: conv/dec/rtp_efr                                ok
958
[   43s]  24: conv/dec/rtp_hr_etsi                            ok
959
[   43s]  25: conv/dec/rtp_hr_ietf                            ok
960
[   43s] 
961
[   43s] ## ------------- ##
962
[   43s] ## Test results. ##
963
[   43s] ## ------------- ##
964
[   43s] 
965
[   43s] ERROR: All 25 tests were run,
966
[   43s] 5 failed unexpectedly.
967
[   43s] ## -------------------------- ##
968
[   43s] ## testsuite.log was created. ##
969
[   43s] ## -------------------------- ##
970
[   43s] 
971
[   43s] Please send `tests/testsuite.log' and all information you think might help:
972
[   43s] 
973
[   43s]    To: <openbsc@lists.osmocom.org>
974
[   43s]    Subject: [gapk 0.4.60] testsuite: 6 9 13 14 22 failed
975
[   43s] 
976
[   43s] You may investigate any problem if you feel able to do so, in which
977
[   43s] case the test suite provides a good starting point.  Its output may
978
[   43s] be found below `tests/testsuite.dir'.
979
[   43s] 
980
[   43s] make[2]: *** [Makefile:723: check-local] Error 1
981
[   43s] make[2]: Leaving directory '/home/abuild/rpmbuild/BUILD/gapk-0.4.60/tests'
982
[   43s] make[1]: *** [Makefile:575: check-am] Error 2
983
[   43s] make[1]: Leaving directory '/home/abuild/rpmbuild/BUILD/gapk-0.4.60/tests'
984
[   43s] make: *** [Makefile:478: check-recursive] Error 1
985
[   43s] + find . -name testsuite.log -exec cat '{}' ';'
986
[   43s] ## ----------------------- ##
987
[   43s] ## gapk 0.4.60 test suite. ##
988
[   43s] ## ----------------------- ##
989
[   43s] 
990
[   43s] testsuite: command line was:
991
[   43s]   $ ./testsuite 
992
[   43s] 
993
[   43s] ## --------- ##
994
[   43s] ## Platform. ##
995
[   43s] ## --------- ##
996
[   43s] 
997
[   43s] hostname = build-new
998
[   43s] uname -m = x86_64
999
[   43s] uname -r = 4.4.114-42-default
1000
[   43s] uname -s = Linux
1001
[   43s] uname -v = #1 SMP Tue Feb 6 10:58:10 UTC 2018 (b6ee9ae)
1002
[   43s] 
1003
[   43s] /usr/bin/uname -p = x86_64
1004
[   43s] /bin/uname -X     = 
1005
[   43s] 
1006
[   43s] /bin/arch              = x86_64
1007
[   43s] /usr/bin/arch -k       = unknown
1008
[   43s] /usr/convex/getsysinfo = unknown
1009
[   43s] /usr/bin/hostinfo      = unknown
1010
[   43s] /bin/machine           = unknown
1011
[   43s] /usr/bin/oslevel       = unknown
1012
[   43s] /bin/universe          = unknown
1013
[   43s] 
1014
[   43s] PATH: /home/abuild/rpmbuild/BUILD/gapk-0.4.60/tests
1015
[   43s] PATH: /usr/local/bin
1016
[   43s] PATH: /usr/bin
1017
[   43s] PATH: /bin
1018
[   43s] PATH: /usr/lib/mit/bin
1019
[   43s] PATH: /usr/lib/mit/sbin
1020
[   43s] 
1021
[   43s] testsuite: atconfig:
1022
[   43s] | # Configurable variable values for building test suites.
1023
[   43s] | # Generated by ./config.status.
1024
[   43s] | # Copyright (C) 2012 Free Software Foundation, Inc.
1025
[   43s] | 
1026
[   43s] | # The test suite will define top_srcdir=/../.. etc.
1027
[   43s] | at_testdir='tests'
1028
[   43s] | abs_builddir='/home/abuild/rpmbuild/BUILD/gapk-0.4.60/tests'
1029
[   43s] | at_srcdir='.'
1030
[   43s] | abs_srcdir='/home/abuild/rpmbuild/BUILD/gapk-0.4.60/tests'
1031
[   43s] | at_top_srcdir='..'
1032
[   43s] | abs_top_srcdir='/home/abuild/rpmbuild/BUILD/gapk-0.4.60'
1033
[   43s] | at_top_build_prefix='../'
1034
[   43s] | abs_top_builddir='/home/abuild/rpmbuild/BUILD/gapk-0.4.60'
1035
[   43s] | 
1036
[   43s] | # Backward compatibility with Autotest <= 2.59b:
1037
[   43s] | at_top_builddir=$at_top_build_prefix
1038
[   43s] | 
1039
[   43s] | AUTOTEST_PATH='tests'
1040
[   43s] | 
1041
[   43s] | SHELL=${CONFIG_SHELL-'/bin/sh'}
1042
[   43s] 
1043
[   43s] testsuite: atlocal:
1044
[   43s] | enable_amr_efr_tests='yes'
1045
[   43s] | enable_hr_tests='yes'
1046
[   43s] | enable_fr_tests='yes'
1047
[   43s] 
1048
[   43s] ## ---------------- ##
1049
[   43s] ## Tested programs. ##
1050
[   43s] ## ---------------- ##
1051
[   43s] 
1052
[   43s] ## ------------------ ##
1053
[   43s] ## Running the tests. ##
1054
[   43s] ## ------------------ ##
1055
[   43s] testsuite: starting at: Mon Feb 12 19:06:40 UTC 2018
1056
[   43s] 1. procqueue (testsuite.at:4): ok     (0m0.017s 0m0.005s)
1057
[   43s] 2. io/pq_file (testsuite.at:10): ok     (0m0.014s 0m0.015s)
1058
[   43s] 3. io/pq_rtp (testsuite.at:19): ok     (0m0.017s 0m0.014s)
1059
[   43s] 4. conv/enc/amr_efr (testsuite.at:26): ok     (0m0.052s 0m0.007s)
1060
[   43s] 5. conv/enc/gsm (testsuite.at:37): ok     (0m0.022s 0m0.004s)
1061
[   43s] 7. conv/enc/racal_fr (testsuite.at:59): ok     (0m0.027s 0m0.002s)
1062
[   43s] 8. conv/enc/racal_efr (testsuite.at:70): ok     (0m0.037s 0m0.010s)
1063
[   43s] 10. conv/enc/ti_fr (testsuite.at:92): ok     (0m0.026s 0m0.002s)
1064
[   43s] 11. conv/enc/ti_efr (testsuite.at:103): ok     (0m0.049s 0m0.001s)
1065
[   43s] 12. conv/enc/rtp_efr (testsuite.at:114): ok     (0m0.047s 0m0.006s)
1066
[   43s] 15. conv/dec/amr_efr (testsuite.at:147): ok     (0m0.022s 0m0.007s)
1067
[   43s] 16. conv/dec/gsm (testsuite.at:158): ok     (0m0.015s 0m0.002s)
1068
[   43s] 17. conv/dec/racal_hr (testsuite.at:169): ok     (0m0.054s 0m0.004s)
1069
[   43s] 18. conv/dec/racal_fr (testsuite.at:180): ok     (0m0.018s 0m0.009s)
1070
[   43s] 19. conv/dec/racal_efr (testsuite.at:191): ok     (0m0.023s 0m0.003s)
1071
[   43s] 20. conv/dec/ti_hr (testsuite.at:202): ok     (0m0.054s 0m0.008s)
1072
[   43s] 21. conv/dec/ti_fr (testsuite.at:213): ok     (0m0.010s 0m0.016s)
1073
[   43s] 23. conv/dec/rtp_efr (testsuite.at:235): ok     (0m0.018s 0m0.010s)
1074
[   43s] 24. conv/dec/rtp_hr_etsi (testsuite.at:246): ok     (0m0.064s 0m0.002s)
1075
[   43s] 25. conv/dec/rtp_hr_ietf (testsuite.at:257): ok     (0m0.056s 0m0.005s)
1076
[   43s] testsuite: ending at: Mon Feb 12 19:06:43 UTC 2018
1077
[   43s] testsuite: test suite duration: 0h 0m 3s
1078
[   43s] 
1079
[   43s] ## ------------- ##
1080
[   43s] ## Test results. ##
1081
[   43s] ## ------------- ##
1082
[   43s] 
1083
[   43s] ERROR: All 25 tests were run,
1084
[   43s] 5 failed unexpectedly.
1085
[   43s] 
1086
[   43s] ## ------------------------ ##
1087
[   43s] ## Summary of the failures. ##
1088
[   43s] ## ------------------------ ##
1089
[   43s] Failed tests:
1090
[   43s] gapk 0.4.60 test suite test groups:
1091
[   43s] 
1092
[   43s]  NUM: FILE-NAME:LINE     TEST-GROUP-NAME
1093
[   43s]       KEYWORDS
1094
[   43s] 
1095
[   43s]    6: testsuite.at:48    conv/enc/racal_hr
1096
[   43s]       racal_hr
1097
[   43s]    9: testsuite.at:81    conv/enc/ti_hr
1098
[   43s]       ti_hr
1099
[   43s]   13: testsuite.at:125   conv/enc/rtp_hr_etsi
1100
[   43s]       rtp_hr_etsi
1101
[   43s]   14: testsuite.at:136   conv/enc/rtp_hr_ietf
1102
[   43s]       rtp_hr_ietf
1103
[   43s]   22: testsuite.at:224   conv/dec/ti_efr
1104
[   43s]       ti_efr
1105
[   43s] 
1106
[   43s] ## ---------------------- ##
1107
[   43s] ## Detailed failed tests. ##
1108
[   43s] ## ---------------------- ##
1109
[   43s] 
1110
[   43s] #                             -*- compilation -*-
1111
[   43s] 6. testsuite.at:48: testing conv/enc/racal_hr ...
1112
[   43s] ./testsuite.at:50: test "x$enable_hr_tests" = xyes || exit 77
1113
[   43s] ./testsuite.at:52:
1114
[   43s] 	$abs_top_builddir/src/osmo-gapk \
1115
[   43s] 		-i $abs_srcdir/ref-files/hhgttg_part1_5.s16 \
1116
[   43s] 		-f rawpcm-s16le -g racal-hr
1117
[   43s] 
1118
[   43s] stderr:
1119
[   43s] <0000> app_osmo_gapk.c:405 Opening I/O streams
1120
[   43s] <0000> app_osmo_gapk.c:408 Using a file as source
1121
[   43s] <0000> app_osmo_gapk.c:457 Using stdout as sink
1122
[   43s] <0000> app_osmo_gapk.c:526 Creating a processing queue
1123
[   43s] <0000> app_osmo_gapk.c:777 Init complete, starting processing queue...
1124
[   43s] <0000> procqueue.c:204 PQ 'main': execution aborted: item 'source/file' returned -1
1125
[   43s] <0000> app_osmo_gapk.c:655 Processed 250 frames
1126
[   43s] <0000> app_osmo_gapk.c:467 Closing I/O streams
1127
[   43s] Binary files expout and /home/abuild/rpmbuild/BUILD/gapk-0.4.60/tests/testsuite.dir/at-groups/6/stdout differ
1128
[   43s] 6. testsuite.at:48: 6. conv/enc/racal_hr (testsuite.at:48): FAILED (testsuite.at:52)
1129
[   43s] 
1130
[   43s] #                             -*- compilation -*-
1131
[   43s] 9. testsuite.at:81: testing conv/enc/ti_hr ...
1132
[   43s] ./testsuite.at:83: test "x$enable_hr_tests" = xyes || exit 77
1133
[   43s] ./testsuite.at:85:
1134
[   43s] 	$abs_top_builddir/src/osmo-gapk \
1135
[   43s] 		-i $abs_srcdir/ref-files/hhgttg_part1_5.s16 \
1136
[   43s] 		-f rawpcm-s16le -g ti-hr
1137
[   43s] 
1138
[   43s] stderr:
1139
[   43s] <0000> app_osmo_gapk.c:405 Opening I/O streams
1140
[   43s] <0000> app_osmo_gapk.c:408 Using a file as source
1141
[   43s] <0000> app_osmo_gapk.c:457 Using stdout as sink
1142
[   43s] <0000> app_osmo_gapk.c:526 Creating a processing queue
1143
[   43s] <0000> app_osmo_gapk.c:777 Init complete, starting processing queue...
1144
[   43s] <0000> procqueue.c:204 PQ 'main': execution aborted: item 'source/file' returned -1
1145
[   43s] <0000> app_osmo_gapk.c:655 Processed 250 frames
1146
[   43s] <0000> app_osmo_gapk.c:467 Closing I/O streams
1147
[   43s] Binary files expout and /home/abuild/rpmbuild/BUILD/gapk-0.4.60/tests/testsuite.dir/at-groups/9/stdout differ
1148
[   43s] 9. testsuite.at:81: 9. conv/enc/ti_hr (testsuite.at:81): FAILED (testsuite.at:85)
1149
[   43s] 
1150
[   43s] #                             -*- compilation -*-
1151
[   43s] 13. testsuite.at:125: testing conv/enc/rtp_hr_etsi ...
1152
[   43s] ./testsuite.at:127: test "x$enable_hr_tests" = xyes || exit 77
1153
[   43s] ./testsuite.at:129:
1154
[   43s] 	$abs_top_builddir/src/osmo-gapk \
1155
[   43s] 		-i $abs_srcdir/ref-files/hhgttg_part1_5.s16 \
1156
[   43s] 		-f rawpcm-s16le -g rtp-hr-etsi
1157
[   43s] 
1158
[   43s] stderr:
1159
[   43s] <0000> app_osmo_gapk.c:405 Opening I/O streams
1160
[   43s] <0000> app_osmo_gapk.c:408 Using a file as source
1161
[   43s] <0000> app_osmo_gapk.c:457 Using stdout as sink
1162
[   43s] <0000> app_osmo_gapk.c:526 Creating a processing queue
1163
[   43s] <0000> app_osmo_gapk.c:777 Init complete, starting processing queue...
1164
[   43s] <0000> procqueue.c:204 PQ 'main': execution aborted: item 'source/file' returned -1
1165
[   43s] <0000> app_osmo_gapk.c:655 Processed 250 frames
1166
[   43s] <0000> app_osmo_gapk.c:467 Closing I/O streams
1167
[   43s] Binary files expout and /home/abuild/rpmbuild/BUILD/gapk-0.4.60/tests/testsuite.dir/at-groups/13/stdout differ
1168
[   43s] 13. testsuite.at:125: 13. conv/enc/rtp_hr_etsi (testsuite.at:125): FAILED (testsuite.at:129)
1169
[   43s] 
1170
[   43s] #                             -*- compilation -*-
1171
[   43s] 14. testsuite.at:136: testing conv/enc/rtp_hr_ietf ...
1172
[   43s] ./testsuite.at:138: test "x$enable_hr_tests" = xyes || exit 77
1173
[   43s] ./testsuite.at:140:
1174
[   43s] 	$abs_top_builddir/src/osmo-gapk \
1175
[   43s] 		-i $abs_srcdir/ref-files/hhgttg_part1_5.s16 \
1176
[   43s] 		-f rawpcm-s16le -g rtp-hr-ietf
1177
[   43s] 
1178
[   43s] stderr:
1179
[   43s] <0000> app_osmo_gapk.c:405 Opening I/O streams
1180
[   43s] <0000> app_osmo_gapk.c:408 Using a file as source
1181
[   43s] <0000> app_osmo_gapk.c:457 Using stdout as sink
1182
[   43s] <0000> app_osmo_gapk.c:526 Creating a processing queue
1183
[   43s] <0000> app_osmo_gapk.c:777 Init complete, starting processing queue...
1184
[   43s] <0000> procqueue.c:204 PQ 'main': execution aborted: item 'source/file' returned -1
1185
[   43s] <0000> app_osmo_gapk.c:655 Processed 250 frames
1186
[   43s] <0000> app_osmo_gapk.c:467 Closing I/O streams
1187
[   43s] Binary files expout and /home/abuild/rpmbuild/BUILD/gapk-0.4.60/tests/testsuite.dir/at-groups/14/stdout differ
1188
[   43s] 14. testsuite.at:136: 14. conv/enc/rtp_hr_ietf (testsuite.at:136): FAILED (testsuite.at:140)
1189
[   43s] 
1190
[   43s] #                             -*- compilation -*-
1191
[   43s] 22. testsuite.at:224: testing conv/dec/ti_efr ...
1192
[   43s] ./testsuite.at:226: test "x$enable_amr_efr_tests" = xyes || exit 77
1193
[   43s] ./testsuite.at:228:
1194
[   43s] 	$abs_top_builddir/src/osmo-gapk \
1195
[   43s] 		-i $abs_srcdir/ref-files/hhgttg_part1_5.s16.ti-efr \
1196
[   43s] 		-f ti-efr -g rawpcm-s16le
1197
[   43s] 
1198
[   43s] stderr:
1199
[   43s] <0000> app_osmo_gapk.c:405 Opening I/O streams
1200
[   43s] <0000> app_osmo_gapk.c:408 Using a file as source
1201
[   43s] <0000> app_osmo_gapk.c:457 Using stdout as sink
1202
[   43s] <0000> app_osmo_gapk.c:526 Creating a processing queue
1203
[   43s] <0000> app_osmo_gapk.c:777 Init complete, starting processing queue...
1204
[   43s] <0000> procqueue.c:204 PQ 'main': execution aborted: item 'source/file' returned -1
1205
[   43s] <0000> app_osmo_gapk.c:655 Processed 250 frames
1206
[   43s] <0000> app_osmo_gapk.c:467 Closing I/O streams
1207
[   43s] Binary files expout and /home/abuild/rpmbuild/BUILD/gapk-0.4.60/tests/testsuite.dir/at-groups/22/stdout differ
1208
[   43s] 22. testsuite.at:224: 22. conv/dec/ti_efr (testsuite.at:224): FAILED (testsuite.at:228)
1209
[   43s] 
1210
[   43s] 
1211
[   43s] ## ------------- ##
1212
[   43s] ## ../config.log ##
1213
[   43s] ## ------------- ##
1214
[   43s] | This file contains any messages produced by compilers while
1215
[   43s] | running configure, to aid debugging if configure makes a mistake.
1216
[   43s] | 
1217
[   43s] | It was created by gapk configure 0.4.60, which was
1218
[   43s] | generated by GNU Autoconf 2.69.  Invocation command line was
1219
[   43s] | 
1220
[   43s] |   $ ./configure --host=x86_64-suse-linux-gnu --build=x86_64-suse-linux-gnu --program-prefix= --disable-dependency-tracking --prefix=/usr --exec-prefix=/usr --bindir=/usr/bin --sbindir=/usr/sbin --sysconfdir=/etc --datadir=/usr/share --includedir=/usr/include --libdir=/usr/lib64 --libexecdir=/usr/lib --localstatedir=/var --sharedstatedir=/var/lib --mandir=/usr/share/man --infodir=/usr/share/info --disable-dependency-tracking --disable-static
1221
[   43s] | 
1222
[   43s] | ## --------- ##
1223
[   43s] | ## Platform. ##
1224
[   43s] | ## --------- ##
1225
[   43s] | 
1226
[   43s] | hostname = build-new
1227
[   43s] | uname -m = x86_64
1228
[   43s] | uname -r = 4.4.114-42-default
1229
[   43s] | uname -s = Linux
1230
[   43s] | uname -v = #1 SMP Tue Feb 6 10:58:10 UTC 2018 (b6ee9ae)
1231
[   43s] | 
1232
[   43s] | /usr/bin/uname -p = x86_64
1233
[   43s] | /bin/uname -X     = 
1234
[   43s] | 
1235
[   43s] | /bin/arch              = x86_64
1236
[   43s] | /usr/bin/arch -k       = unknown
1237
[   43s] | /usr/convex/getsysinfo = unknown
1238
[   43s] | /usr/bin/hostinfo      = unknown
1239
[   43s] | /bin/machine           = unknown
1240
[   43s] | /usr/bin/oslevel       = unknown
1241
[   43s] | /bin/universe          = unknown
1242
[   43s] | 
1243
[   43s] | PATH: /usr/local/bin
1244
[   43s] | PATH: /usr/bin
1245
[   43s] | PATH: /bin
1246
[   43s] | PATH: /usr/lib/mit/bin
1247
[   43s] | PATH: /usr/lib/mit/sbin
1248
[   43s] | 
1249
[   43s] | 
1250
[   43s] | ## ----------- ##
1251
[   43s] | ## Core tests. ##
1252
[   43s] | ## ----------- ##
1253
[   43s] | 
1254
[   43s] | configure:2454: checking for a BSD-compatible install
1255
[   43s] | configure:2522: result: /usr/bin/install -c
1256
[   43s] | configure:2533: checking whether build environment is sane
1257
[   43s] | configure:2588: result: yes
1258
[   43s] | configure:2739: checking for a thread-safe mkdir -p
1259
[   43s] | configure:2778: result: /usr/bin/mkdir -p
1260
[   43s] | configure:2785: checking for gawk
1261
[   43s] | configure:2801: found /usr/bin/gawk
1262
[   43s] | configure:2812: result: gawk
1263
[   43s] | configure:2823: checking whether make sets $(MAKE)
1264
[   43s] | configure:2845: result: yes
1265
[   43s] | configure:2874: checking whether make supports nested variables
1266
[   43s] | configure:2891: result: yes
1267
[   43s] | configure:3046: checking build system type
1268
[   43s] | configure:3060: result: x86_64-suse-linux-gnu
1269
[   43s] | configure:3080: checking host system type
1270
[   43s] | configure:3093: result: x86_64-suse-linux-gnu
1271
[   43s] | configure:3134: checking how to print strings
1272
[   43s] | configure:3161: result: printf
1273
[   43s] | configure:3194: checking for style of include used by make
1274
[   43s] | configure:3222: result: GNU
1275
[   43s] | configure:3253: checking for x86_64-suse-linux-gnu-gcc
1276
[   43s] | configure:3283: result: no
1277
[   43s] | configure:3293: checking for gcc
1278
[   43s] | configure:3309: found /usr/bin/gcc
1279
[   43s] | configure:3320: result: gcc
1280
[   43s] | configure:3549: checking for C compiler version
1281
[   43s] | configure:3558: gcc --version >&5
1282
[   43s] | gcc (SUSE Linux) 7.3.0
1283
[   43s] | Copyright (C) 2017 Free Software Foundation, Inc.
1284
[   43s] | This is free software; see the source for copying conditions.  There is NO
1285
[   43s] | warranty; not even for MERCHANTABILITY or FITNESS FOR A PARTICULAR PURPOSE.
1286
[   43s] | 
1287
[   43s] | configure:3569: $? = 0
1288
[   43s] | configure:3558: gcc -v >&5
1289
[   43s] | Using built-in specs.
1290
[   43s] | Reading specs from /usr/lib64/gcc/x86_64-suse-linux/7/defaults.spec
1291
[   43s] | COLLECT_GCC=gcc
1292
[   43s] | COLLECT_LTO_WRAPPER=/usr/lib64/gcc/x86_64-suse-linux/7/lto-wrapper
1293
[   43s] | OFFLOAD_TARGET_NAMES=hsa:nvptx-none
1294
[   43s] | Target: x86_64-suse-linux
1295
[   43s] | Configured with: ../configure --prefix=/usr --infodir=/usr/share/info --mandir=/usr/share/man --libdir=/usr/lib64 --libexecdir=/usr/lib64 --enable-languages=c,c++,objc,fortran,obj-c++,ada,go --enable-offload-targets=hsa,nvptx-none=/usr/nvptx-none, --without-cuda-driver --enable-checking=release --disable-werror --with-gxx-include-dir=/usr/include/c++/7 --enable-ssp --disable-libssp --disable-libvtv --disable-libcc1 --enable-plugin --with-bugurl=http://bugs.opensuse.org/ --with-pkgversion='SUSE Linux' --with-slibdir=/lib64 --with-system-zlib --enable-__cxa_atexit --enable-libstdcxx-allocator=new --disable-libstdcxx-pch --enable-version-specific-runtime-libs --with-gcc-major-version-only --enable-linker-build-id --enable-linux-futex --enable-gnu-indirect-function --program-suffix=-7 --without-system-libunwind --enable-multilib --with-arch-32=x86-64 --with-tune=generic --build=x86_64-suse-linux --host=x86_64-suse-linux
1296
[   43s] | Thread model: posix
1297
[   43s] | gcc version 7.3.0 (SUSE Linux) 
1298
[   43s] | configure:3569: $? = 0
1299
[   43s] | configure:3558: gcc -V >&5
1300
[   43s] | gcc: error: unrecognized command line option '-V'
1301
[   43s] | gcc: fatal error: no input files
1302
[   43s] | compilation terminated.
1303
[   43s] | configure:3569: $? = 1
1304
[   43s] | configure:3558: gcc -qversion >&5
1305
[   43s] | gcc: error: unrecognized command line option '-qversion'; did you mean '--version'?
1306
[   43s] | gcc: fatal error: no input files
1307
[   43s] | compilation terminated.
1308
[   43s] | configure:3569: $? = 1
1309
[   43s] | configure:3589: checking whether the C compiler works
1310
[   43s] | configure:3611: gcc -fmessage-length=0 -grecord-gcc-switches -O2 -Wall -D_FORTIFY_SOURCE=2 -fstack-protector-strong -funwind-tables -fasynchronous-unwind-tables -fstack-clash-protection -g   conftest.c  >&5
1311
[   43s] | configure:3615: $? = 0
1312
[   43s] | configure:3663: result: yes
1313
[   43s] | configure:3666: checking for C compiler default output file name
1314
[   43s] | configure:3668: result: a.out
1315
[   43s] | configure:3674: checking for suffix of executables
1316
[   43s] | configure:3681: gcc -o conftest -fmessage-length=0 -grecord-gcc-switches -O2 -Wall -D_FORTIFY_SOURCE=2 -fstack-protector-strong -funwind-tables -fasynchronous-unwind-tables -fstack-clash-protection -g   conftest.c  >&5
1317
[   43s] | configure:3685: $? = 0
1318
[   43s] | configure:3707: result: 
1319
[   43s] | configure:3729: checking whether we are cross compiling
1320
[   43s] | configure:3737: gcc -o conftest -fmessage-length=0 -grecord-gcc-switches -O2 -Wall -D_FORTIFY_SOURCE=2 -fstack-protector-strong -funwind-tables -fasynchronous-unwind-tables -fstack-clash-protection -g   conftest.c  >&5
1321
[   43s] | configure:3741: $? = 0
1322
[   43s] | configure:3748: ./conftest
1323
[   43s] | configure:3752: $? = 0
1324
[   43s] | configure:3767: result: no
1325
[   43s] | configure:3772: checking for suffix of object files
1326
[   43s] | configure:3794: gcc -c -fmessage-length=0 -grecord-gcc-switches -O2 -Wall -D_FORTIFY_SOURCE=2 -fstack-protector-strong -funwind-tables -fasynchronous-unwind-tables -fstack-clash-protection -g  conftest.c >&5
1327
[   43s] | configure:3798: $? = 0
1328
[   43s] | configure:3819: result: o
1329
[   43s] | configure:3823: checking whether we are using the GNU C compiler
1330
[   43s] | configure:3842: gcc -c -fmessage-length=0 -grecord-gcc-switches -O2 -Wall -D_FORTIFY_SOURCE=2 -fstack-protector-strong -funwind-tables -fasynchronous-unwind-tables -fstack-clash-protection -g  conftest.c >&5
1331
[   43s] | configure:3842: $? = 0
1332
[   43s] | configure:3851: result: yes
1333
[   43s] | configure:3860: checking whether gcc accepts -g
1334
[   43s] | configure:3880: gcc -c -g  conftest.c >&5
1335
[   43s] | configure:3880: $? = 0
1336
[   43s] | configure:3921: result: yes
1337
[   43s] | configure:3938: checking for gcc option to accept ISO C89
1338
[   43s] | configure:4001: gcc  -c -fmessage-length=0 -grecord-gcc-switches -O2 -Wall -D_FORTIFY_SOURCE=2 -fstack-protector-strong -funwind-tables -fasynchronous-unwind-tables -fstack-clash-protection -g  conftest.c >&5
1339
[   43s] | configure:4001: $? = 0
1340
[   43s] | configure:4014: result: none needed
1341
[   43s] | configure:4039: checking whether gcc understands -c and -o together
1342
[   43s] | configure:4061: gcc -c conftest.c -o conftest2.o
1343
[   43s] | configure:4064: $? = 0
1344
[   43s] | configure:4061: gcc -c conftest.c -o conftest2.o
1345
[   43s] | configure:4064: $? = 0
1346
[   43s] | configure:4076: result: yes
1347
[   43s] | configure:4095: checking dependency style of gcc
1348
[   43s] | configure:4206: result: none
1349
[   43s] | configure:4221: checking for a sed that does not truncate output
1350
[   43s] | configure:4285: result: /usr/bin/sed
1351
[   43s] | configure:4303: checking for grep that handles long lines and -e
1352
[   43s] | configure:4361: result: /usr/bin/grep
1353
[   43s] | configure:4366: checking for egrep
1354
[   43s] | configure:4428: result: /usr/bin/grep -E
1355
[   43s] | configure:4433: checking for fgrep
1356
[   43s] | configure:4495: result: /usr/bin/grep -F
1357
[   43s] | configure:4530: checking for ld used by gcc
1358
[   43s] | configure:4597: result: /usr/x86_64-suse-linux/bin/ld
1359
[   43s] | configure:4604: checking if the linker (/usr/x86_64-suse-linux/bin/ld) is GNU ld
1360
[   43s] | configure:4619: result: yes
1361
[   43s] | configure:4631: checking for BSD- or MS-compatible name lister (nm)
1362
[   43s] | configure:4685: result: /usr/bin/nm -B
1363
[   43s] | configure:4815: checking the name lister (/usr/bin/nm -B) interface
1364
[   43s] | configure:4822: gcc -c -fmessage-length=0 -grecord-gcc-switches -O2 -Wall -D_FORTIFY_SOURCE=2 -fstack-protector-strong -funwind-tables -fasynchronous-unwind-tables -fstack-clash-protection -g  conftest.c >&5
1365
[   43s] | configure:4825: /usr/bin/nm -B "conftest.o"
1366
[   43s] | configure:4828: output
1367
[   43s] | 0000000000000000 B some_variable
1368
[   43s] | configure:4835: result: BSD nm
1369
[   43s] | configure:4838: checking whether ln -s works
1370
[   43s] | configure:4842: result: yes
1371
[   43s] | configure:4850: checking the maximum length of command line arguments
1372
[   43s] | configure:4981: result: 1572864
1373
[   43s] | configure:5029: checking how to convert x86_64-suse-linux-gnu file names to x86_64-suse-linux-gnu format
1374
[   43s] | configure:5069: result: func_convert_file_noop
1375
[   43s] | configure:5076: checking how to convert x86_64-suse-linux-gnu file names to toolchain format
1376
[   43s] | configure:5096: result: func_convert_file_noop
1377
[   43s] | configure:5103: checking for /usr/x86_64-suse-linux/bin/ld option to reload object files
1378
[   43s] | configure:5110: result: -r
1379
[   43s] | configure:5144: checking for x86_64-suse-linux-gnu-objdump
1380
[   43s] | configure:5174: result: no
1381
[   43s] | configure:5184: checking for objdump
1382
[   43s] | configure:5200: found /usr/bin/objdump
1383
[   43s] | configure:5211: result: objdump
1384
[   43s] | configure:5243: checking how to recognize dependent libraries
1385
[   43s] | configure:5443: result: pass_all
1386
[   43s] | configure:5488: checking for x86_64-suse-linux-gnu-dlltool
1387
[   43s] | configure:5518: result: no
1388
[   43s] | configure:5528: checking for dlltool
1389
[   43s] | configure:5558: result: no
1390
[   43s] | configure:5588: checking how to associate runtime and link libraries
1391
[   43s] | configure:5615: result: printf %s\n
1392
[   43s] | configure:5632: checking for x86_64-suse-linux-gnu-ar
1393
[   43s] | configure:5662: result: no
1394
[   43s] | configure:5676: checking for ar
1395
[   43s] | configure:5692: found /usr/bin/ar
1396
[   43s] | configure:5703: result: ar
1397
[   43s] | configure:5740: checking for archiver @FILE support
1398
[   43s] | configure:5757: gcc -c -fmessage-length=0 -grecord-gcc-switches -O2 -Wall -D_FORTIFY_SOURCE=2 -fstack-protector-strong -funwind-tables -fasynchronous-unwind-tables -fstack-clash-protection -g  conftest.c >&5
1399
[   43s] | configure:5757: $? = 0
1400
[   43s] | configure:5760: ar cru libconftest.a @conftest.lst >&5
1401
[   43s] | configure:5763: $? = 0
1402
[   43s] | configure:5768: ar cru libconftest.a @conftest.lst >&5
1403
[   43s] | ar: conftest.o: No such file or directory
1404
[   43s] | configure:5771: $? = 1
1405
[   43s] | configure:5783: result: @
1406
[   43s] | configure:5801: checking for x86_64-suse-linux-gnu-strip
1407
[   43s] | configure:5831: result: no
1408
[   43s] | configure:5841: checking for strip
1409
[   43s] | configure:5857: found /usr/bin/strip
1410
[   43s] | configure:5868: result: strip
1411
[   43s] | configure:5900: checking for x86_64-suse-linux-gnu-ranlib
1412
[   43s] | configure:5930: result: no
1413
[   43s] | configure:5940: checking for ranlib
1414
[   43s] | configure:5956: found /usr/bin/ranlib
1415
[   43s] | configure:5967: result: ranlib
1416
[   43s] | configure:6069: checking command to parse /usr/bin/nm -B output from gcc object
1417
[   43s] | configure:6222: gcc -c -fmessage-length=0 -grecord-gcc-switches -O2 -Wall -D_FORTIFY_SOURCE=2 -fstack-protector-strong -funwind-tables -fasynchronous-unwind-tables -fstack-clash-protection -g  conftest.c >&5
1418
[   43s] | configure:6225: $? = 0
1419
[   43s] | configure:6229: /usr/bin/nm -B conftest.o \| sed -n -e 's/^.*[ ]\([ABCDGIRSTW][ABCDGIRSTW]*\)[ ][ ]*\([_A-Za-z][_A-Za-z0-9]*\)$/\1 \2 \2/p' | sed '/ __gnu_lto/d' \> conftest.nm
1420
[   43s] | configure:6232: $? = 0
1421
[   43s] | configure:6298: gcc -o conftest -fmessage-length=0 -grecord-gcc-switches -O2 -Wall -D_FORTIFY_SOURCE=2 -fstack-protector-strong -funwind-tables -fasynchronous-unwind-tables -fstack-clash-protection -g   conftest.c conftstm.o >&5
1422
[   43s] | configure:6301: $? = 0
1423
[   43s] | configure:6339: result: ok
1424
[   43s] | configure:6386: checking for sysroot
1425
[   43s] | configure:6416: result: no
1426
[   43s] | configure:6423: checking for a working dd
1427
[   43s] | configure:6461: result: /usr/bin/dd
1428
[   43s] | configure:6465: checking how to truncate binary pipes
1429
[   43s] | configure:6480: result: /usr/bin/dd bs=4096 count=1
1430
[   43s] | configure:6616: gcc -c -fmessage-length=0 -grecord-gcc-switches -O2 -Wall -D_FORTIFY_SOURCE=2 -fstack-protector-strong -funwind-tables -fasynchronous-unwind-tables -fstack-clash-protection -g  conftest.c >&5
1431
[   43s] | configure:6619: $? = 0
1432
[   43s] | configure:6769: checking for x86_64-suse-linux-gnu-mt
1433
[   43s] | configure:6799: result: no
1434
[   43s] | configure:6809: checking for mt
1435
[   43s] | configure:6839: result: no
1436
[   43s] | configure:6859: checking if : is a manifest tool
1437
[   43s] | configure:6865: : '-?'
1438
[   43s] | configure:6873: result: no
1439
[   43s] | configure:7550: checking how to run the C preprocessor
1440
[   43s] | configure:7581: gcc -E  conftest.c
1441
[   43s] | configure:7581: $? = 0
1442
[   43s] | configure:7595: gcc -E  conftest.c
1443
[   43s] | conftest.c:11:10: fatal error: ac_nonexistent.h: No such file or directory
1444
[   43s] |  #include <ac_nonexistent.h>
1445
[   43s] |           ^~~~~~~~~~~~~~~~~~
1446
[   43s] | compilation terminated.
1447
[   43s] | configure:7595: $? = 1
1448
[   43s] | configure: failed program was:
1449
[   43s] | | /* confdefs.h */
1450
[   43s] | | #define PACKAGE_NAME "gapk"
1451
[   43s] | | #define PACKAGE_TARNAME "gapk"
1452
[   43s] | | #define PACKAGE_VERSION "0.4.60"
1453
[   43s] | | #define PACKAGE_STRING "gapk 0.4.60"
1454
[   43s] | | #define PACKAGE_BUGREPORT "openbsc@lists.osmocom.org"
1455
[   43s] | | #define PACKAGE_URL ""
1456
[   43s] | | #define PACKAGE "gapk"
1457
[   43s] | | #define VERSION "0.4.60"
1458
[   43s] | | /* end confdefs.h.  */
1459
[   43s] | | #include <ac_nonexistent.h>
1460
[   43s] | configure:7620: result: gcc -E
1461
[   43s] | configure:7640: gcc -E  conftest.c
1462
[   43s] | configure:7640: $? = 0
1463
[   43s] | configure:7654: gcc -E  conftest.c
1464
[   43s] | conftest.c:11:10: fatal error: ac_nonexistent.h: No such file or directory
1465
[   43s] |  #include <ac_nonexistent.h>
1466
[   43s] |           ^~~~~~~~~~~~~~~~~~
1467
[   43s] | compilation terminated.
1468
[   43s] | configure:7654: $? = 1
1469
[   43s] | configure: failed program was:
1470
[   43s] | | /* confdefs.h */
1471
[   43s] | | #define PACKAGE_NAME "gapk"
1472
[   43s] | | #define PACKAGE_TARNAME "gapk"
1473
[   43s] | | #define PACKAGE_VERSION "0.4.60"
1474
[   43s] | | #define PACKAGE_STRING "gapk 0.4.60"
1475
[   43s] | | #define PACKAGE_BUGREPORT "openbsc@lists.osmocom.org"
1476
[   43s] | | #define PACKAGE_URL ""
1477
[   43s] | | #define PACKAGE "gapk"
1478
[   43s] | | #define VERSION "0.4.60"
1479
[   43s] | | /* end confdefs.h.  */
1480
[   43s] | | #include <ac_nonexistent.h>
1481
[   43s] | configure:7683: checking for ANSI C header files
1482
[   43s] | configure:7703: gcc -c -fmessage-length=0 -grecord-gcc-switches -O2 -Wall -D_FORTIFY_SOURCE=2 -fstack-protector-strong -funwind-tables -fasynchronous-unwind-tables -fstack-clash-protection -g  conftest.c >&5
1483
[   43s] | configure:7703: $? = 0
1484
[   43s] | configure:7776: gcc -o conftest -fmessage-length=0 -grecord-gcc-switches -O2 -Wall -D_FORTIFY_SOURCE=2 -fstack-protector-strong -funwind-tables -fasynchronous-unwind-tables -fstack-clash-protection -g   conftest.c  >&5
1485
[   43s] | configure:7776: $? = 0
1486
[   43s] | configure:7776: ./conftest
1487
[   43s] | configure:7776: $? = 0
1488
[   43s] | configure:7787: result: yes
1489
[   43s] | configure:7800: checking for sys/types.h
1490
[   43s] | configure:7800: gcc -c -fmessage-length=0 -grecord-gcc-switches -O2 -Wall -D_FORTIFY_SOURCE=2 -fstack-protector-strong -funwind-tables -fasynchronous-unwind-tables -fstack-clash-protection -g  conftest.c >&5
1491
[   43s] | configure:7800: $? = 0
1492
[   43s] | configure:7800: result: yes
1493
[   43s] | configure:7800: checking for sys/stat.h
1494
[   43s] | configure:7800: gcc -c -fmessage-length=0 -grecord-gcc-switches -O2 -Wall -D_FORTIFY_SOURCE=2 -fstack-protector-strong -funwind-tables -fasynchronous-unwind-tables -fstack-clash-protection -g  conftest.c >&5
1495
[   43s] | configure:7800: $? = 0
1496
[   43s] | configure:7800: result: yes
1497
[   43s] | configure:7800: checking for stdlib.h
1498
[   43s] | configure:7800: gcc -c -fmessage-length=0 -grecord-gcc-switches -O2 -Wall -D_FORTIFY_SOURCE=2 -fstack-protector-strong -funwind-tables -fasynchronous-unwind-tables -fstack-clash-protection -g  conftest.c >&5
1499
[   43s] | configure:7800: $? = 0
1500
[   43s] | configure:7800: result: yes
1501
[   43s] | configure:7800: checking for string.h
1502
[   43s] | configure:7800: gcc -c -fmessage-length=0 -grecord-gcc-switches -O2 -Wall -D_FORTIFY_SOURCE=2 -fstack-protector-strong -funwind-tables -fasynchronous-unwind-tables -fstack-clash-protection -g  conftest.c >&5
1503
[   43s] | configure:7800: $? = 0
1504
[   43s] | configure:7800: result: yes
1505
[   43s] | configure:7800: checking for memory.h
1506
[   43s] | configure:7800: gcc -c -fmessage-length=0 -grecord-gcc-switches -O2 -Wall -D_FORTIFY_SOURCE=2 -fstack-protector-strong -funwind-tables -fasynchronous-unwind-tables -fstack-clash-protection -g  conftest.c >&5
1507
[   43s] | configure:7800: $? = 0
1508
[   43s] | configure:7800: result: yes
1509
[   43s] | configure:7800: checking for strings.h
1510
[   43s] | configure:7800: gcc -c -fmessage-length=0 -grecord-gcc-switches -O2 -Wall -D_FORTIFY_SOURCE=2 -fstack-protector-strong -funwind-tables -fasynchronous-unwind-tables -fstack-clash-protection -g  conftest.c >&5
1511
[   43s] | configure:7800: $? = 0
1512
[   43s] | configure:7800: result: yes
1513
[   43s] | configure:7800: checking for inttypes.h
1514
[   43s] | configure:7800: gcc -c -fmessage-length=0 -grecord-gcc-switches -O2 -Wall -D_FORTIFY_SOURCE=2 -fstack-protector-strong -funwind-tables -fasynchronous-unwind-tables -fstack-clash-protection -g  conftest.c >&5
1515
[   43s] | configure:7800: $? = 0
1516
[   43s] | configure:7800: result: yes
1517
[   43s] | configure:7800: checking for stdint.h
1518
[   43s] | configure:7800: gcc -c -fmessage-length=0 -grecord-gcc-switches -O2 -Wall -D_FORTIFY_SOURCE=2 -fstack-protector-strong -funwind-tables -fasynchronous-unwind-tables -fstack-clash-protection -g  conftest.c >&5
1519
[   43s] | configure:7800: $? = 0
1520
[   43s] | configure:7800: result: yes
1521
[   43s] | configure:7800: checking for unistd.h
1522
[   43s] | configure:7800: gcc -c -fmessage-length=0 -grecord-gcc-switches -O2 -Wall -D_FORTIFY_SOURCE=2 -fstack-protector-strong -funwind-tables -fasynchronous-unwind-tables -fstack-clash-protection -g  conftest.c >&5
1523
[   43s] | configure:7800: $? = 0
1524
[   43s] | configure:7800: result: yes
1525
[   43s] | configure:7814: checking for dlfcn.h
1526
[   43s] | configure:7814: gcc -c -fmessage-length=0 -grecord-gcc-switches -O2 -Wall -D_FORTIFY_SOURCE=2 -fstack-protector-strong -funwind-tables -fasynchronous-unwind-tables -fstack-clash-protection -g  conftest.c >&5
1527
[   43s] | configure:7814: $? = 0
1528
[   43s] | configure:7814: result: yes
1529
[   43s] | configure:8069: checking for objdir
1530
[   43s] | configure:8084: result: .libs
1531
[   43s] | configure:8348: checking if gcc supports -fno-rtti -fno-exceptions
1532
[   43s] | configure:8366: gcc -c -fmessage-length=0 -grecord-gcc-switches -O2 -Wall -D_FORTIFY_SOURCE=2 -fstack-protector-strong -funwind-tables -fasynchronous-unwind-tables -fstack-clash-protection -g  -fno-rtti -fno-exceptions conftest.c >&5
1533
[   43s] | cc1: warning: command line option '-fno-rtti' is valid for C++/ObjC++ but not for C
1534
[   43s] | configure:8370: $? = 0
1535
[   43s] | configure:8383: result: no
1536
[   43s] | configure:8741: checking for gcc option to produce PIC
1537
[   43s] | configure:8748: result: -fPIC -DPIC
1538
[   43s] | configure:8756: checking if gcc PIC flag -fPIC -DPIC works
1539
[   43s] | configure:8774: gcc -c -fmessage-length=0 -grecord-gcc-switches -O2 -Wall -D_FORTIFY_SOURCE=2 -fstack-protector-strong -funwind-tables -fasynchronous-unwind-tables -fstack-clash-protection -g  -fPIC -DPIC -DPIC conftest.c >&5
1540
[   43s] | configure:8778: $? = 0
1541
[   43s] | configure:8791: result: yes
1542
[   43s] | configure:8820: checking if gcc static flag -static works
1543
[   43s] | configure:8848: result: no
1544
[   43s] | configure:8863: checking if gcc supports -c -o file.o
1545
[   43s] | configure:8884: gcc -c -fmessage-length=0 -grecord-gcc-switches -O2 -Wall -D_FORTIFY_SOURCE=2 -fstack-protector-strong -funwind-tables -fasynchronous-unwind-tables -fstack-clash-protection -g  -o out/conftest2.o conftest.c >&5
1546
[   43s] | configure:8888: $? = 0
1547
[   43s] | configure:8910: result: yes
1548
[   43s] | configure:8918: checking if gcc supports -c -o file.o
1549
[   43s] | configure:8965: result: yes
1550
[   43s] | configure:8998: checking whether the gcc linker (/usr/x86_64-suse-linux/bin/ld -m elf_x86_64) supports shared libraries
1551
[   43s] | configure:10257: result: yes
1552
[   43s] | configure:10294: checking whether -lc should be explicitly linked in
1553
[   43s] | configure:10302: gcc -c -fmessage-length=0 -grecord-gcc-switches -O2 -Wall -D_FORTIFY_SOURCE=2 -fstack-protector-strong -funwind-tables -fasynchronous-unwind-tables -fstack-clash-protection -g  conftest.c >&5
1554
[   43s] | configure:10305: $? = 0
1555
[   43s] | configure:10320: gcc -shared  -fPIC -DPIC conftest.o  -v -Wl,-soname -Wl,conftest -o conftest 2\>\&1 \| /usr/bin/grep  -lc  \>/dev/null 2\>\&1
1556
[   43s] | configure:10323: $? = 0
1557
[   43s] | configure:10337: result: no
1558
[   43s] | configure:10497: checking dynamic linker characteristics
1559
[   43s] | configure:11078: gcc -o conftest -fmessage-length=0 -grecord-gcc-switches -O2 -Wall -D_FORTIFY_SOURCE=2 -fstack-protector-strong -funwind-tables -fasynchronous-unwind-tables -fstack-clash-protection -g   -Wl,-rpath -Wl,/foo conftest.c  >&5
1560
[   43s] | configure:11078: $? = 0
1561
[   43s] | configure:11315: result: GNU/Linux ld.so
1562
[   43s] | configure:11437: checking how to hardcode library paths into programs
1563
[   43s] | configure:11462: result: immediate
1564
[   43s] | configure:12010: checking whether stripping libraries is possible
1565
[   43s] | configure:12015: result: yes
1566
[   43s] | configure:12050: checking if libtool supports shared libraries
1567
[   43s] | configure:12052: result: yes
1568
[   43s] | configure:12055: checking whether to build shared libraries
1569
[   43s] | configure:12080: result: yes
1570
[   43s] | configure:12083: checking whether to build static libraries
1571
[   43s] | configure:12087: result: no
1572
[   43s] | configure:12137: checking whether make supports nested variables
1573
[   43s] | configure:12154: result: yes
1574
[   43s] | configure:12227: checking for a Python interpreter with version >= 2.4
1575
[   43s] | configure:12244: python -c import sys # split strings by '.' and convert to numeric. Append some zeros # because we need at least 4 digits for the hex conversion. # map returns an iterator in Python 3.0 and a list in 2.x minver = list(map(int, '2.4'.split('.'))) + [0, 0, 0] minverhex = 0 # xrange is not present in Python 3.0 and range returns an iterator for i in list(range(0, 4)): minverhex = (minverhex << 8) + minver[i] sys.exit(sys.hexversion < minverhex)
1576
[   43s] | configure:12247: $? = 0
1577
[   43s] | configure:12253: result: python
1578
[   43s] | configure:12261: checking for python
1579
[   43s] | configure:12279: found /usr/bin/python
1580
[   43s] | configure:12291: result: /usr/bin/python
1581
[   43s] | configure:12309: checking for python version
1582
[   43s] | configure:12316: result: 2.7
1583
[   43s] | configure:12328: checking for python platform
1584
[   43s] | configure:12335: result: linux2
1585
[   43s] | configure:12361: checking for python script directory
1586
[   43s] | configure:12396: result: ${prefix}/lib/python2.7/site-packages
1587
[   43s] | configure:12405: checking for python extension module directory
1588
[   43s] | configure:12440: result: ${exec_prefix}/lib64/python2.7/site-packages
1589
[   43s] | configure:12462: checking if gcc supports -fvisibility=hidden
1590
[   43s] | configure:12468: gcc -c -fmessage-length=0 -grecord-gcc-switches -O2 -Wall -D_FORTIFY_SOURCE=2 -fstack-protector-strong -funwind-tables -fasynchronous-unwind-tables -fstack-clash-protection -g -fvisibility=hidden   conftest.c >&5
1591
[   43s] | configure:12468: $? = 0
1592
[   43s] | configure:12469: result: yes
1593
[   43s] | configure:12498: checking for x86_64-suse-linux-gnu-gcc
1594
[   43s] | configure:12525: result: gcc
1595
[   43s] | configure:12794: checking for C compiler version
1596
[   43s] | configure:12803: gcc --version >&5
1597
[   43s] | gcc (SUSE Linux) 7.3.0
1598
[   43s] | Copyright (C) 2017 Free Software Foundation, Inc.
1599
[   43s] | This is free software; see the source for copying conditions.  There is NO
1600
[   43s] | warranty; not even for MERCHANTABILITY or FITNESS FOR A PARTICULAR PURPOSE.
1601
[   43s] | 
1602
[   43s] | configure:12814: $? = 0
1603
[   43s] | configure:12803: gcc -v >&5
1604
[   43s] | Using built-in specs.
1605
[   43s] | Reading specs from /usr/lib64/gcc/x86_64-suse-linux/7/defaults.spec
1606
[   43s] | COLLECT_GCC=gcc
1607
[   43s] | COLLECT_LTO_WRAPPER=/usr/lib64/gcc/x86_64-suse-linux/7/lto-wrapper
1608
[   43s] | OFFLOAD_TARGET_NAMES=hsa:nvptx-none
1609
[   43s] | Target: x86_64-suse-linux
1610
[   43s] | Configured with: ../configure --prefix=/usr --infodir=/usr/share/info --mandir=/usr/share/man --libdir=/usr/lib64 --libexecdir=/usr/lib64 --enable-languages=c,c++,objc,fortran,obj-c++,ada,go --enable-offload-targets=hsa,nvptx-none=/usr/nvptx-none, --without-cuda-driver --enable-checking=release --disable-werror --with-gxx-include-dir=/usr/include/c++/7 --enable-ssp --disable-libssp --disable-libvtv --disable-libcc1 --enable-plugin --with-bugurl=http://bugs.opensuse.org/ --with-pkgversion='SUSE Linux' --with-slibdir=/lib64 --with-system-zlib --enable-__cxa_atexit --enable-libstdcxx-allocator=new --disable-libstdcxx-pch --enable-version-specific-runtime-libs --with-gcc-major-version-only --enable-linker-build-id --enable-linux-futex --enable-gnu-indirect-function --program-suffix=-7 --without-system-libunwind --enable-multilib --with-arch-32=x86-64 --with-tune=generic --build=x86_64-suse-linux --host=x86_64-suse-linux
1611
[   43s] | Thread model: posix
1612
[   43s] | gcc version 7.3.0 (SUSE Linux) 
1613
[   43s] | configure:12814: $? = 0
1614
[   43s] | configure:12803: gcc -V >&5
1615
[   43s] | gcc: error: unrecognized command line option '-V'
1616
[   43s] | gcc: fatal error: no input files
1617
[   43s] | compilation terminated.
1618
[   43s] | configure:12814: $? = 1
1619
[   43s] | configure:12803: gcc -qversion >&5
1620
[   43s] | gcc: error: unrecognized command line option '-qversion'; did you mean '--version'?
1621
[   43s] | gcc: fatal error: no input files
1622
[   43s] | compilation terminated.
1623
[   43s] | configure:12814: $? = 1
1624
[   43s] | configure:12818: checking whether we are using the GNU C compiler
1625
[   43s] | configure:12846: result: yes
1626
[   43s] | configure:12855: checking whether gcc accepts -g
1627
[   43s] | configure:12916: result: yes
1628
[   43s] | configure:12933: checking for gcc option to accept ISO C89
1629
[   43s] | configure:13009: result: none needed
1630
[   43s] | configure:13034: checking whether gcc understands -c and -o together
1631
[   43s] | configure:13071: result: yes
1632
[   43s] | configure:13090: checking dependency style of gcc
1633
[   43s] | configure:13201: result: none
1634
[   43s] | configure:13230: checking for x86_64-suse-linux-gnu-pkg-config
1635
[   43s] | configure:13248: found /usr/bin/x86_64-suse-linux-gnu-pkg-config
1636
[   43s] | configure:13260: result: /usr/bin/x86_64-suse-linux-gnu-pkg-config
1637
[   43s] | configure:13328: checking pkg-config is at least version 0.9.0
1638
[   43s] | configure:13331: result: yes
1639
[   43s] | configure:13341: checking for libosmocore >= 0.3.2
1640
[   43s] | configure:13348: $PKG_CONFIG --exists --print-errors "libosmocore >= 0.3.2"
1641
[   43s] | configure:13351: $? = 0
1642
[   43s] | configure:13365: $PKG_CONFIG --exists --print-errors "libosmocore >= 0.3.2"
1643
[   43s] | configure:13368: $? = 0
1644
[   43s] | configure:13426: result: yes
1645
[   43s] | configure:13432: checking for libosmocodec >= 0.1.25
1646
[   43s] | configure:13439: $PKG_CONFIG --exists --print-errors "libosmocodec >= 0.1.25"
1647
[   43s] | configure:13442: $? = 0
1648
[   43s] | configure:13456: $PKG_CONFIG --exists --print-errors "libosmocodec >= 0.1.25"
1649
[   43s] | configure:13459: $? = 0
1650
[   43s] | configure:13517: result: yes
1651
[   43s] | configure:13523: checking for alsa
1652
[   43s] | configure:13530: $PKG_CONFIG --exists --print-errors "alsa"
1653
[   43s] | configure:13533: $? = 0
1654
[   43s] | configure:13547: $PKG_CONFIG --exists --print-errors "alsa"
1655
[   43s] | configure:13550: $? = 0
1656
[   43s] | configure:13608: result: yes
1657
[   43s] | configure:13619: checking for opencore-amrnb >= 0.1.0
1658
[   43s] | configure:13626: $PKG_CONFIG --exists --print-errors "opencore-amrnb >= 0.1.0"
1659
[   43s] | configure:13629: $? = 0
1660
[   43s] | configure:13643: $PKG_CONFIG --exists --print-errors "opencore-amrnb >= 0.1.0"
1661
[   43s] | configure:13646: $? = 0
1662
[   43s] | configure:13684: result: yes
1663
[   43s] | configure:13698: checking gsm/gsm.h usability
1664
[   43s] | configure:13698: gcc -c -fmessage-length=0 -grecord-gcc-switches -O2 -Wall -D_FORTIFY_SOURCE=2 -fstack-protector-strong -funwind-tables -fasynchronous-unwind-tables -fstack-clash-protection -g  conftest.c >&5
1665
[   43s] | configure:13698: $? = 0
1666
[   43s] | configure:13698: result: yes
1667
[   43s] | configure:13698: checking gsm/gsm.h presence
1668
[   43s] | configure:13698: gcc -E  conftest.c
1669
[   43s] | configure:13698: $? = 0
1670
[   43s] | configure:13698: result: yes
1671
[   43s] | configure:13698: checking for gsm/gsm.h
1672
[   43s] | configure:13698: result: yes
1673
[   43s] | configure:13723: checking for gsm_create in -lgsm
1674
[   43s] | configure:13748: gcc -o conftest -fmessage-length=0 -grecord-gcc-switches -O2 -Wall -D_FORTIFY_SOURCE=2 -fstack-protector-strong -funwind-tables -fasynchronous-unwind-tables -fstack-clash-protection -g   conftest.c -lgsm   >&5
1675
[   43s] | configure:13748: $? = 0
1676
[   43s] | configure:13757: result: yes
1677
[   43s] | configure:13784: checking for stdint.h
1678
[   43s] | configure:13784: result: yes
1679
[   43s] | configure:13784: checking for stdlib.h
1680
[   43s] | configure:13784: result: yes
1681
[   43s] | configure:13784: checking for string.h
1682
[   43s] | configure:13784: result: yes
1683
[   43s] | configure:13784: checking for unistd.h
1684
[   43s] | configure:13784: result: yes
1685
[   43s] | configure:13796: checking for inline
1686
[   43s] | configure:13812: gcc -c -fmessage-length=0 -grecord-gcc-switches -O2 -Wall -D_FORTIFY_SOURCE=2 -fstack-protector-strong -funwind-tables -fasynchronous-unwind-tables -fstack-clash-protection -g  conftest.c >&5
1687
[   43s] | configure:13812: $? = 0
1688
[   43s] | configure:13820: result: inline
1689
[   43s] | configure:13838: checking for int16_t
1690
[   43s] | configure:13838: gcc -c -fmessage-length=0 -grecord-gcc-switches -O2 -Wall -D_FORTIFY_SOURCE=2 -fstack-protector-strong -funwind-tables -fasynchronous-unwind-tables -fstack-clash-protection -g  conftest.c >&5
1691
[   43s] | configure:13838: $? = 0
1692
[   43s] | configure:13838: gcc -c -fmessage-length=0 -grecord-gcc-switches -O2 -Wall -D_FORTIFY_SOURCE=2 -fstack-protector-strong -funwind-tables -fasynchronous-unwind-tables -fstack-clash-protection -g  conftest.c >&5
1693
[   43s] | conftest.c: In function 'main':
1694
[   43s] | conftest.c:69:12: error: size of array 'test_array' is negative
1695
[   43s] |  static int test_array [1 - 2 * !((int16_t) (((((int16_t) 1 << N) << N) - 1) * 2 + 1)
1696
[   43s] |             ^~~~~~~~~~
1697
[   43s] | configure:13838: $? = 1
1698
[   43s] | configure: failed program was:
1699
[   43s] | | /* confdefs.h */
1700
[   43s] | | #define PACKAGE_NAME "gapk"
1701
[   43s] | | #define PACKAGE_TARNAME "gapk"
1702
[   43s] | | #define PACKAGE_VERSION "0.4.60"
1703
[   43s] | | #define PACKAGE_STRING "gapk 0.4.60"
1704
[   43s] | | #define PACKAGE_BUGREPORT "openbsc@lists.osmocom.org"
1705
[   43s] | | #define PACKAGE_URL ""
1706
[   43s] | | #define PACKAGE "gapk"
1707
[   43s] | | #define VERSION "0.4.60"
1708
[   43s] | | #define STDC_HEADERS 1
1709
[   43s] | | #define HAVE_SYS_TYPES_H 1
1710
[   43s] | | #define HAVE_SYS_STAT_H 1
1711
[   43s] | | #define HAVE_STDLIB_H 1
1712
[   43s] | | #define HAVE_STRING_H 1
1713
[   43s] | | #define HAVE_MEMORY_H 1
1714
[   43s] | | #define HAVE_STRINGS_H 1
1715
[   43s] | | #define HAVE_INTTYPES_H 1
1716
[   43s] | | #define HAVE_STDINT_H 1
1717
[   43s] | | #define HAVE_UNISTD_H 1
1718
[   43s] | | #define HAVE_DLFCN_H 1
1719
[   43s] | | #define LT_OBJDIR ".libs/"
1720
[   43s] | | #define HAVE_LIBGSMHR 1
1721
[   43s] | | #define HAVE_ALSA 1
1722
[   43s] | | #define HAVE_OPENCORE_AMRNB 1
1723
[   43s] | | #define HAVE_GSM_GSM_H 1
1724
[   43s] | | #define HAVE_LIBGSM 1
1725
[   43s] | | #define HAVE_STDINT_H 1
1726
[   43s] | | #define HAVE_STDLIB_H 1
1727
[   43s] | | #define HAVE_STRING_H 1
1728
[   43s] | | #define HAVE_UNISTD_H 1
1729
[   43s] | | /* end confdefs.h.  */
1730
[   43s] | | #include <stdio.h>
1731
[   43s] | | #ifdef HAVE_SYS_TYPES_H
1732
[   43s] | | # include <sys/types.h>
1733
[   43s] | | #endif
1734
[   43s] | | #ifdef HAVE_SYS_STAT_H
1735
[   43s] | | # include <sys/stat.h>
1736
[   43s] | | #endif
1737
[   43s] | | #ifdef STDC_HEADERS
1738
[   43s] | | # include <stdlib.h>
1739
[   43s] | | # include <stddef.h>
1740
[   43s] | | #else
1741
[   43s] | | # ifdef HAVE_STDLIB_H
1742
[   43s] | | #  include <stdlib.h>
1743
[   43s] | | # endif
1744
[   43s] | | #endif
1745
[   43s] | | #ifdef HAVE_STRING_H
1746
[   43s] | | # if !defined STDC_HEADERS && defined HAVE_MEMORY_H
1747
[   43s] | | #  include <memory.h>
1748
[   43s] | | # endif
1749
[   43s] | | # include <string.h>
1750
[   43s] | | #endif
1751
[   43s] | | #ifdef HAVE_STRINGS_H
1752
[   43s] | | # include <strings.h>
1753
[   43s] | | #endif
1754
[   43s] | | #ifdef HAVE_INTTYPES_H
1755
[   43s] | | # include <inttypes.h>
1756
[   43s] | | #endif
1757
[   43s] | | #ifdef HAVE_STDINT_H
1758
[   43s] | | # include <stdint.h>
1759
[   43s] | | #endif
1760
[   43s] | | #ifdef HAVE_UNISTD_H
1761
[   43s] | | # include <unistd.h>
1762
[   43s] | | #endif
1763
[   43s] | | 	        enum { N = 16 / 2 - 1 };
1764
[   43s] | | int
1765
[   43s] | | main ()
1766
[   43s] | | {
1767
[   43s] | | static int test_array [1 - 2 * !((int16_t) (((((int16_t) 1 << N) << N) - 1) * 2 + 1)
1768
[   43s] | | 		 < (int16_t) (((((int16_t) 1 << N) << N) - 1) * 2 + 2))];
1769
[   43s] | | test_array [0] = 0;
1770
[   43s] | | return test_array [0];
1771
[   43s] | | 
1772
[   43s] | |   ;
1773
[   43s] | |   return 0;
1774
[   43s] | | }
1775
[   43s] | configure:13838: result: yes
1776
[   43s] | configure:13849: checking for int32_t
1777
[   43s] | configure:13849: gcc -c -fmessage-length=0 -grecord-gcc-switches -O2 -Wall -D_FORTIFY_SOURCE=2 -fstack-protector-strong -funwind-tables -fasynchronous-unwind-tables -fstack-clash-protection -g  conftest.c >&5
1778
[   43s] | configure:13849: $? = 0
1779
[   43s] | configure:13849: gcc -c -fmessage-length=0 -grecord-gcc-switches -O2 -Wall -D_FORTIFY_SOURCE=2 -fstack-protector-strong -funwind-tables -fasynchronous-unwind-tables -fstack-clash-protection -g  conftest.c >&5
1780
[   43s] | conftest.c: In function 'main':
1781
[   43s] | conftest.c:70:53: warning: integer overflow in expression [-Woverflow]
1782
[   43s] |     < (int32_t) (((((int32_t) 1 << N) << N) - 1) * 2 + 2))];
1783
[   43s] |                                                      ^
1784
[   43s] | conftest.c:69:12: error: storage size of 'test_array' isn't constant
1785
[   43s] |  static int test_array [1 - 2 * !((int32_t) (((((int32_t) 1 << N) << N) - 1) * 2 + 1)
1786
[   43s] |             ^~~~~~~~~~
1787
[   43s] | conftest.c:69:12: warning: unused variable 'test_array' [-Wunused-variable]
1788
[   43s] | configure:13849: $? = 1
1789
[   43s] | configure: failed program was:
1790
[   43s] | | /* confdefs.h */
1791
[   43s] | | #define PACKAGE_NAME "gapk"
1792
[   43s] | | #define PACKAGE_TARNAME "gapk"
1793
[   43s] | | #define PACKAGE_VERSION "0.4.60"
1794
[   43s] | | #define PACKAGE_STRING "gapk 0.4.60"
1795
[   43s] | | #define PACKAGE_BUGREPORT "openbsc@lists.osmocom.org"
1796
[   43s] | | #define PACKAGE_URL ""
1797
[   43s] | | #define PACKAGE "gapk"
1798
[   43s] | | #define VERSION "0.4.60"
1799
[   43s] | | #define STDC_HEADERS 1
1800
[   43s] | | #define HAVE_SYS_TYPES_H 1
1801
[   43s] | | #define HAVE_SYS_STAT_H 1
1802
[   43s] | | #define HAVE_STDLIB_H 1
1803
[   43s] | | #define HAVE_STRING_H 1
1804
[   43s] | | #define HAVE_MEMORY_H 1
1805
[   43s] | | #define HAVE_STRINGS_H 1
1806
[   43s] | | #define HAVE_INTTYPES_H 1
1807
[   43s] | | #define HAVE_STDINT_H 1
1808
[   43s] | | #define HAVE_UNISTD_H 1
1809
[   43s] | | #define HAVE_DLFCN_H 1
1810
[   43s] | | #define LT_OBJDIR ".libs/"
1811
[   43s] | | #define HAVE_LIBGSMHR 1
1812
[   43s] | | #define HAVE_ALSA 1
1813
[   43s] | | #define HAVE_OPENCORE_AMRNB 1
1814
[   43s] | | #define HAVE_GSM_GSM_H 1
1815
[   43s] | | #define HAVE_LIBGSM 1
1816
[   43s] | | #define HAVE_STDINT_H 1
1817
[   43s] | | #define HAVE_STDLIB_H 1
1818
[   43s] | | #define HAVE_STRING_H 1
1819
[   43s] | | #define HAVE_UNISTD_H 1
1820
[   43s] | | /* end confdefs.h.  */
1821
[   43s] | | #include <stdio.h>
1822
[   43s] | | #ifdef HAVE_SYS_TYPES_H
1823
[   43s] | | # include <sys/types.h>
1824
[   43s] | | #endif
1825
[   43s] | | #ifdef HAVE_SYS_STAT_H
1826
[   43s] | | # include <sys/stat.h>
1827
[   43s] | | #endif
1828
[   43s] | | #ifdef STDC_HEADERS
1829
[   43s] | | # include <stdlib.h>
1830
[   43s] | | # include <stddef.h>
1831
[   43s] | | #else
1832
[   43s] | | # ifdef HAVE_STDLIB_H
1833
[   43s] | | #  include <stdlib.h>
1834
[   43s] | | # endif
1835
[   43s] | | #endif
1836
[   43s] | | #ifdef HAVE_STRING_H
1837
[   43s] | | # if !defined STDC_HEADERS && defined HAVE_MEMORY_H
1838
[   43s] | | #  include <memory.h>
1839
[   43s] | | # endif
1840
[   43s] | | # include <string.h>
1841
[   43s] | | #endif
1842
[   43s] | | #ifdef HAVE_STRINGS_H
1843
[   43s] | | # include <strings.h>
1844
[   43s] | | #endif
1845
[   43s] | | #ifdef HAVE_INTTYPES_H
1846
[   43s] | | # include <inttypes.h>
1847
[   43s] | | #endif
1848
[   43s] | | #ifdef HAVE_STDINT_H
1849
[   43s] | | # include <stdint.h>
1850
[   43s] | | #endif
1851
[   43s] | | #ifdef HAVE_UNISTD_H
1852
[   43s] | | # include <unistd.h>
1853
[   43s] | | #endif
1854
[   43s] | | 	        enum { N = 32 / 2 - 1 };
1855
[   43s] | | int
1856
[   43s] | | main ()
1857
[   43s] | | {
1858
[   43s] | | static int test_array [1 - 2 * !((int32_t) (((((int32_t) 1 << N) << N) - 1) * 2 + 1)
1859
[   43s] | | 		 < (int32_t) (((((int32_t) 1 << N) << N) - 1) * 2 + 2))];
1860
[   43s] | | test_array [0] = 0;
1861
[   43s] | | return test_array [0];
1862
[   43s] | | 
1863
[   43s] | |   ;
1864
[   43s] | |   return 0;
1865
[   43s] | | }
1866
[   43s] | configure:13849: result: yes
1867
[   43s] | configure:13860: checking for uint16_t
1868
[   43s] | configure:13860: gcc -c -fmessage-length=0 -grecord-gcc-switches -O2 -Wall -D_FORTIFY_SOURCE=2 -fstack-protector-strong -funwind-tables -fasynchronous-unwind-tables -fstack-clash-protection -g  conftest.c >&5
1869
[   43s] | configure:13860: $? = 0
1870
[   43s] | configure:13860: result: yes
1871
[   43s] | configure:13872: checking for uint32_t
1872
[   43s] | configure:13872: gcc -c -fmessage-length=0 -grecord-gcc-switches -O2 -Wall -D_FORTIFY_SOURCE=2 -fstack-protector-strong -funwind-tables -fasynchronous-unwind-tables -fstack-clash-protection -g  conftest.c >&5
1873
[   43s] | configure:13872: $? = 0
1874
[   43s] | configure:13872: result: yes
1875
[   43s] | configure:13886: checking for uint64_t
1876
[   43s] | configure:13886: gcc -c -fmessage-length=0 -grecord-gcc-switches -O2 -Wall -D_FORTIFY_SOURCE=2 -fstack-protector-strong -funwind-tables -fasynchronous-unwind-tables -fstack-clash-protection -g  conftest.c >&5
1877
[   43s] | configure:13886: $? = 0
1878
[   43s] | configure:13886: result: yes
1879
[   43s] | configure:13900: checking for uint8_t
1880
[   43s] | configure:13900: gcc -c -fmessage-length=0 -grecord-gcc-switches -O2 -Wall -D_FORTIFY_SOURCE=2 -fstack-protector-strong -funwind-tables -fasynchronous-unwind-tables -fstack-clash-protection -g  conftest.c >&5
1881
[   43s] | configure:13900: $? = 0
1882
[   43s] | configure:13900: result: yes
1883
[   43s] | configure:13918: checking for stdlib.h
1884
[   43s] | configure:13918: result: yes
1885
[   43s] | configure:13928: checking for GNU libc compatible malloc
1886
[   43s] | configure:13952: gcc -o conftest -fmessage-length=0 -grecord-gcc-switches -O2 -Wall -D_FORTIFY_SOURCE=2 -fstack-protector-strong -funwind-tables -fasynchronous-unwind-tables -fstack-clash-protection -g   conftest.c  >&5
1887
[   43s] | configure:13952: $? = 0
1888
[   43s] | configure:13952: ./conftest
1889
[   43s] | configure:13952: $? = 0
1890
[   43s] | configure:13962: result: yes
1891
[   43s] | configure:13985: checking for memset
1892
[   43s] | configure:13985: gcc -o conftest -fmessage-length=0 -grecord-gcc-switches -O2 -Wall -D_FORTIFY_SOURCE=2 -fstack-protector-strong -funwind-tables -fasynchronous-unwind-tables -fstack-clash-protection -g   conftest.c  >&5
1893
[   43s] | conftest.c:57:6: warning: conflicting types for built-in function 'memset' [-Wbuiltin-declaration-mismatch]
1894
[   43s] |  char memset ();
1895
[   43s] |       ^~~~~~
1896
[   43s] | configure:13985: $? = 0
1897
[   43s] | configure:13985: result: yes
1898
[   43s] | configure:14104: checking that generated files are newer than configure
1899
[   43s] | configure:14110: result: done
1900
[   43s] | configure:14141: creating ./config.status
1901
[   43s] | 
1902
[   43s] | ## ---------------------- ##
1903
[   43s] | ## Running config.status. ##
1904
[   43s] | ## ---------------------- ##
1905
[   43s] | 
1906
[   43s] | This file was extended by gapk config.status 0.4.60, which was
1907
[   43s] | generated by GNU Autoconf 2.69.  Invocation command line was
1908
[   43s] | 
1909
[   43s] |   CONFIG_FILES    = 
1910
[   43s] |   CONFIG_HEADERS  = 
1911
[   43s] |   CONFIG_LINKS    = 
1912
[   43s] |   CONFIG_COMMANDS = 
1913
[   43s] |   $ ./config.status 
1914
[   43s] | 
1915
[   43s] | on build-new
1916
[   43s] | 
1917
[   43s] | config.status:1133: creating Makefile
1918
[   43s] | config.status:1133: creating src/Makefile
1919
[   43s] | config.status:1133: creating libgsmhr/Makefile
1920
[   43s] | config.status:1133: creating include/Makefile
1921
[   43s] | config.status:1133: creating include/gsmhr/Makefile
1922
[   43s] | config.status:1133: creating libosmogapk.pc
1923
[   43s] | config.status:1133: creating tests/atlocal
1924
[   43s] | config.status:1133: creating tests/Makefile
1925
[   43s] | config.status:1133: creating config.h
1926
[   43s] | config.status:1362: executing depfiles commands
1927
[   43s] | config.status:1362: executing libtool commands
1928
[   43s] | config.status:1362: executing tests/atconfig commands
1929
[   43s] | 
1930
[   43s] | ## ---------------- ##
1931
[   43s] | ## Cache variables. ##
1932
[   43s] | ## ---------------- ##
1933
[   43s] | 
1934
[   43s] | ac_cv_build=x86_64-suse-linux-gnu
1935
[   43s] | ac_cv_c_compiler_gnu=yes
1936
[   43s] | ac_cv_c_inline=inline
1937
[   43s] | ac_cv_c_int16_t=yes
1938
[   43s] | ac_cv_c_int32_t=yes
1939
[   43s] | ac_cv_c_uint16_t=yes
1940
[   43s] | ac_cv_c_uint32_t=yes
1941
[   43s] | ac_cv_c_uint64_t=yes
1942
[   43s] | ac_cv_c_uint8_t=yes
1943
[   43s] | ac_cv_env_CC_set=
1944
[   43s] | ac_cv_env_CC_value=
1945
[   43s] | ac_cv_env_CFLAGS_set=set
1946
[   43s] | ac_cv_env_CFLAGS_value='-fmessage-length=0 -grecord-gcc-switches -O2 -Wall -D_FORTIFY_SOURCE=2 -fstack-protector-strong -funwind-tables -fasynchronous-unwind-tables -fstack-clash-protection -g'
1947
[   43s] | ac_cv_env_CPPFLAGS_set=
1948
[   43s] | ac_cv_env_CPPFLAGS_value=
1949
[   43s] | ac_cv_env_CPP_set=
1950
[   43s] | ac_cv_env_CPP_value=
1951
[   43s] | ac_cv_env_LDFLAGS_set=
1952
[   43s] | ac_cv_env_LDFLAGS_value=
1953
[   43s] | ac_cv_env_LIBALSA_CFLAGS_set=
1954
[   43s] | ac_cv_env_LIBALSA_CFLAGS_value=
1955
[   43s] | ac_cv_env_LIBALSA_LIBS_set=
1956
[   43s] | ac_cv_env_LIBALSA_LIBS_value=
1957
[   43s] | ac_cv_env_LIBOSMOCODEC_CFLAGS_set=
1958
[   43s] | ac_cv_env_LIBOSMOCODEC_CFLAGS_value=
1959
[   43s] | ac_cv_env_LIBOSMOCODEC_LIBS_set=
1960
[   43s] | ac_cv_env_LIBOSMOCODEC_LIBS_value=
1961
[   43s] | ac_cv_env_LIBOSMOCORE_CFLAGS_set=
1962
[   43s] | ac_cv_env_LIBOSMOCORE_CFLAGS_value=
1963
[   43s] | ac_cv_env_LIBOSMOCORE_LIBS_set=
1964
[   43s] | ac_cv_env_LIBOSMOCORE_LIBS_value=
1965
[   43s] | ac_cv_env_LIBS_set=
1966
[   43s] | ac_cv_env_LIBS_value=
1967
[   43s] | ac_cv_env_LT_SYS_LIBRARY_PATH_set=
1968
[   43s] | ac_cv_env_LT_SYS_LIBRARY_PATH_value=
1969
[   43s] | ac_cv_env_OPENCORE_AMRNB_CFLAGS_set=
1970
[   43s] | ac_cv_env_OPENCORE_AMRNB_CFLAGS_value=
1971
[   43s] | ac_cv_env_OPENCORE_AMRNB_LIBS_set=
1972
[   43s] | ac_cv_env_OPENCORE_AMRNB_LIBS_value=
1973
[   43s] | ac_cv_env_PKG_CONFIG_LIBDIR_set=
1974
[   43s] | ac_cv_env_PKG_CONFIG_LIBDIR_value=
1975
[   43s] | ac_cv_env_PKG_CONFIG_PATH_set=set
1976
[   43s] | ac_cv_env_PKG_CONFIG_PATH_value=:/usr/lib64/pkgconfig:/usr/share/pkgconfig
1977
[   43s] | ac_cv_env_PKG_CONFIG_set=
1978
[   43s] | ac_cv_env_PKG_CONFIG_value=
1979
[   43s] | ac_cv_env_PYTHON_set=
1980
[   43s] | ac_cv_env_PYTHON_value=
1981
[   43s] | ac_cv_env_build_alias_set=set
1982
[   43s] | ac_cv_env_build_alias_value=x86_64-suse-linux-gnu
1983
[   43s] | ac_cv_env_host_alias_set=set
1984
[   43s] | ac_cv_env_host_alias_value=x86_64-suse-linux-gnu
1985
[   43s] | ac_cv_env_target_alias_set=
1986
[   43s] | ac_cv_env_target_alias_value=
1987
[   43s] | ac_cv_func_malloc_0_nonnull=yes
1988
[   43s] | ac_cv_func_memset=yes
1989
[   43s] | ac_cv_header_dlfcn_h=yes
1990
[   43s] | ac_cv_header_gsm_gsm_h=yes
1991
[   43s] | ac_cv_header_inttypes_h=yes
1992
[   43s] | ac_cv_header_memory_h=yes
1993
[   43s] | ac_cv_header_stdc=yes
1994
[   43s] | ac_cv_header_stdint_h=yes
1995
[   43s] | ac_cv_header_stdlib_h=yes
1996
[   43s] | ac_cv_header_string_h=yes
1997
[   43s] | ac_cv_header_strings_h=yes
1998
[   43s] | ac_cv_header_sys_stat_h=yes
1999
[   43s] | ac_cv_header_sys_types_h=yes
2000
[   43s] | ac_cv_header_unistd_h=yes
2001
[   43s] | ac_cv_host=x86_64-suse-linux-gnu
2002
[   43s] | ac_cv_lib_gsm_gsm_create=yes
2003
[   43s] | ac_cv_objext=o
2004
[   43s] | ac_cv_path_EGREP='/usr/bin/grep -E'
2005
[   43s] | ac_cv_path_FGREP='/usr/bin/grep -F'
2006
[   43s] | ac_cv_path_GREP=/usr/bin/grep
2007
[   43s] | ac_cv_path_PKG_CONFIG=/usr/bin/x86_64-suse-linux-gnu-pkg-config
2008
[   43s] | ac_cv_path_PYTHON=/usr/bin/python
2009
[   43s] | ac_cv_path_SED=/usr/bin/sed
2010
[   43s] | ac_cv_path_install='/usr/bin/install -c'
2011
[   43s] | ac_cv_path_lt_DD=/usr/bin/dd
2012
[   43s] | ac_cv_path_mkdir=/usr/bin/mkdir
2013
[   43s] | ac_cv_prog_AWK=gawk
2014
[   43s] | ac_cv_prog_CC=gcc
2015
[   43s] | ac_cv_prog_CPP='gcc -E'
2016
[   43s] | ac_cv_prog_ac_ct_AR=ar
2017
[   43s] | ac_cv_prog_ac_ct_CC=gcc
2018
[   43s] | ac_cv_prog_ac_ct_OBJDUMP=objdump
2019
[   43s] | ac_cv_prog_ac_ct_RANLIB=ranlib
2020
[   43s] | ac_cv_prog_ac_ct_STRIP=strip
2021
[   43s] | ac_cv_prog_cc_c89=
2022
[   43s] | ac_cv_prog_cc_g=yes
2023
[   43s] | ac_cv_prog_make_make_set=yes
2024
[   43s] | am_cv_CC_dependencies_compiler_type=none
2025
[   43s] | am_cv_make_support_nested_variables=yes
2026
[   43s] | am_cv_pathless_PYTHON=python
2027
[   43s] | am_cv_prog_cc_c_o=yes
2028
[   43s] | am_cv_python_platform=linux2
2029
[   43s] | am_cv_python_pyexecdir='${exec_prefix}/lib64/python2.7/site-packages'
2030
[   43s] | am_cv_python_pythondir='${prefix}/lib/python2.7/site-packages'
2031
[   43s] | am_cv_python_version=2.7
2032
[   43s] | lt_cv_ar_at_file=@
2033
[   43s] | lt_cv_archive_cmds_need_lc=no
2034
[   43s] | lt_cv_deplibs_check_method=pass_all
2035
[   43s] | lt_cv_file_magic_cmd='$MAGIC_CMD'
2036
[   43s] | lt_cv_file_magic_test_file=
2037
[   43s] | lt_cv_ld_reload_flag=-r
2038
[   43s] | lt_cv_nm_interface='BSD nm'
2039
[   43s] | lt_cv_objdir=.libs
2040
[   43s] | lt_cv_path_LD=/usr/x86_64-suse-linux/bin/ld
2041
[   43s] | lt_cv_path_NM='/usr/bin/nm -B'
2042
[   43s] | lt_cv_path_mainfest_tool=no
2043
[   43s] | lt_cv_prog_compiler_c_o=yes
2044
[   43s] | lt_cv_prog_compiler_pic='-fPIC -DPIC'
2045
[   43s] | lt_cv_prog_compiler_pic_works=yes
2046
[   43s] | lt_cv_prog_compiler_rtti_exceptions=no
2047
[   43s] | lt_cv_prog_compiler_static_works=no
2048
[   43s] | lt_cv_prog_gnu_ld=yes
2049
[   43s] | lt_cv_sharedlib_from_linklib_cmd='printf %s\n'
2050
[   43s] | lt_cv_shlibpath_overrides_runpath=yes
2051
[   43s] | lt_cv_sys_global_symbol_pipe='sed -n -e '\''s/^.*[	 ]\([ABCDGIRSTW][ABCDGIRSTW]*\)[	 ][	 ]*\([_A-Za-z][_A-Za-z0-9]*\)$/\1 \2 \2/p'\'' | sed '\''/ __gnu_lto/d'\'''
2052
[   43s] | lt_cv_sys_global_symbol_to_c_name_address='sed -n -e '\''s/^: \(.*\) .*$/  {"\1", (void *) 0},/p'\'' -e '\''s/^[ABCDGIRSTW][ABCDGIRSTW]* .* \(.*\)$/  {"\1", (void *) \&\1},/p'\'''
2053
[   43s] | lt_cv_sys_global_symbol_to_c_name_address_lib_prefix='sed -n -e '\''s/^: \(.*\) .*$/  {"\1", (void *) 0},/p'\'' -e '\''s/^[ABCDGIRSTW][ABCDGIRSTW]* .* \(lib.*\)$/  {"\1", (void *) \&\1},/p'\'' -e '\''s/^[ABCDGIRSTW][ABCDGIRSTW]* .* \(.*\)$/  {"lib\1", (void *) \&\1},/p'\'''
2054
[   43s] | lt_cv_sys_global_symbol_to_cdecl='sed -n -e '\''s/^T .* \(.*\)$/extern int \1();/p'\'' -e '\''s/^[ABCDGIRSTW][ABCDGIRSTW]* .* \(.*\)$/extern char \1;/p'\'''
2055
[   43s] | lt_cv_sys_global_symbol_to_import=
2056
[   43s] | lt_cv_sys_max_cmd_len=1572864
2057
[   43s] | lt_cv_to_host_file_cmd=func_convert_file_noop
2058
[   43s] | lt_cv_to_tool_file_cmd=func_convert_file_noop
2059
[   43s] | lt_cv_truncate_bin='/usr/bin/dd bs=4096 count=1'
2060
[   43s] | pkg_cv_LIBALSA_CFLAGS=-I/usr/include/alsa
2061
[   43s] | pkg_cv_LIBALSA_LIBS=-lasound
2062
[   43s] | pkg_cv_LIBOSMOCODEC_CFLAGS=-I/usr/include/libosmocore/
2063
[   43s] | pkg_cv_LIBOSMOCODEC_LIBS=-losmocodec
2064
[   43s] | pkg_cv_LIBOSMOCORE_CFLAGS=-I/usr/include/libosmocore/
2065
[   43s] | pkg_cv_LIBOSMOCORE_LIBS='-ltalloc -losmocore'
2066
[   43s] | pkg_cv_OPENCORE_AMRNB_CFLAGS=
2067
[   43s] | pkg_cv_OPENCORE_AMRNB_LIBS=-lopencore-amrnb
2068
[   43s] | 
2069
[   43s] | ## ----------------- ##
2070
[   43s] | ## Output variables. ##
2071
[   43s] | ## ----------------- ##
2072
[   43s] | 
2073
[   43s] | ACLOCAL='${SHELL} /home/abuild/rpmbuild/BUILD/gapk-0.4.60/missing aclocal-1.15'
2074
[   43s] | AMDEPBACKSLASH=''
2075
[   43s] | AMDEP_FALSE=''
2076
[   43s] | AMDEP_TRUE='#'
2077
[   43s] | AMTAR='$${TAR-tar}'
2078
[   43s] | AM_BACKSLASH='\'
2079
[   43s] | AM_DEFAULT_V='$(AM_DEFAULT_VERBOSITY)'
2080
[   43s] | AM_DEFAULT_VERBOSITY='0'
2081
[   43s] | AM_V='$(V)'
2082
[   43s] | AR='ar'
2083
[   43s] | AUTOCONF='${SHELL} /home/abuild/rpmbuild/BUILD/gapk-0.4.60/missing autoconf'
2084
[   43s] | AUTOHEADER='${SHELL} /home/abuild/rpmbuild/BUILD/gapk-0.4.60/missing autoheader'
2085
[   43s] | AUTOMAKE='${SHELL} /home/abuild/rpmbuild/BUILD/gapk-0.4.60/missing automake-1.15'
2086
[   43s] | AWK='gawk'
2087
[   43s] | CC='gcc'
2088
[   43s] | CCDEPMODE='depmode=none'
2089
[   43s] | CFLAGS='-fmessage-length=0 -grecord-gcc-switches -O2 -Wall -D_FORTIFY_SOURCE=2 -fstack-protector-strong -funwind-tables -fasynchronous-unwind-tables -fstack-clash-protection -g'
2090
[   43s] | CPP='gcc -E'
2091
[   43s] | CPPFLAGS=''
2092
[   43s] | CYGPATH_W='echo'
2093
[   43s] | DEFS='-DHAVE_CONFIG_H'
2094
[   43s] | DEPDIR='.deps'
2095
[   43s] | DLLTOOL='false'
2096
[   43s] | DSYMUTIL=''
2097
[   43s] | DUMPBIN=''
2098
[   43s] | ECHO_C=''
2099
[   43s] | ECHO_N='-n'
2100
[   43s] | ECHO_T=''
2101
[   43s] | EGREP='/usr/bin/grep -E'
2102
[   43s] | ENABLE_AMR_EFR_TESTS='yes'
2103
[   43s] | ENABLE_FR_TESTS='yes'
2104
[   43s] | ENABLE_GSMHR_FALSE='#'
2105
[   43s] | ENABLE_GSMHR_TRUE=''
2106
[   43s] | ENABLE_HR_TESTS='yes'
2107
[   43s] | EXEEXT=''
2108
[   43s] | FGREP='/usr/bin/grep -F'
2109
[   43s] | GREP='/usr/bin/grep'
2110
[   43s] | INSTALL_DATA='${INSTALL} -m 644'
2111
[   43s] | INSTALL_PROGRAM='${INSTALL}'
2112
[   43s] | INSTALL_SCRIPT='${INSTALL}'
2113
[   43s] | INSTALL_STRIP_PROGRAM='$(install_sh) -c -s'
2114
[   43s] | LD='/usr/x86_64-suse-linux/bin/ld -m elf_x86_64'
2115
[   43s] | LDFLAGS=''
2116
[   43s] | LIBALSA_CFLAGS='-I/usr/include/alsa'
2117
[   43s] | LIBALSA_LIBS='-lasound'
2118
[   43s] | LIBGSM_LIBS='-lgsm'
2119
[   43s] | LIBOBJS=''
2120
[   43s] | LIBOSMOCODEC_CFLAGS='-I/usr/include/libosmocore/'
2121
[   43s] | LIBOSMOCODEC_LIBS='-losmocodec'
2122
[   43s] | LIBOSMOCORE_CFLAGS='-I/usr/include/libosmocore/'
2123
[   43s] | LIBOSMOCORE_LIBS='-ltalloc -losmocore'
2124
[   43s] | LIBS=''
2125
[   43s] | LIBTOOL='$(SHELL) $(top_builddir)/libtool'
2126
[   43s] | LIPO=''
2127
[   43s] | LN_S='ln -s'
2128
[   43s] | LTLDFLAGS_OSMOGAPK='-Wl,--version-script=$(srcdir)/libosmogapk.map'
2129
[   43s] | LTLIBOBJS=''
2130
[   43s] | LT_SYS_LIBRARY_PATH=''
2131
[   43s] | MAKEINFO='${SHELL} /home/abuild/rpmbuild/BUILD/gapk-0.4.60/missing makeinfo'
2132
[   43s] | MANIFEST_TOOL=':'
2133
[   43s] | MKDIR_P='/usr/bin/mkdir -p'
2134
[   43s] | NM='/usr/bin/nm -B'
2135
[   43s] | NMEDIT=''
2136
[   43s] | OBJDUMP='objdump'
2137
[   43s] | OBJEXT='o'
2138
[   43s] | OPENCORE_AMRNB_CFLAGS=''
2139
[   43s] | OPENCORE_AMRNB_LIBS='-lopencore-amrnb'
2140
[   43s] | OTOOL64=''
2141
[   43s] | OTOOL=''
2142
[   43s] | PACKAGE='gapk'
2143
[   43s] | PACKAGE_BUGREPORT='openbsc@lists.osmocom.org'
2144
[   43s] | PACKAGE_NAME='gapk'
2145
[   43s] | PACKAGE_STRING='gapk 0.4.60'
2146
[   43s] | PACKAGE_TARNAME='gapk'
2147
[   43s] | PACKAGE_URL=''
2148
[   43s] | PACKAGE_VERSION='0.4.60'
2149
[   43s] | PATH_SEPARATOR=':'
2150
[   43s] | PKG_CONFIG='/usr/bin/x86_64-suse-linux-gnu-pkg-config'
2151
[   43s] | PKG_CONFIG_LIBDIR=''
2152
[   43s] | PKG_CONFIG_PATH=':/usr/lib64/pkgconfig:/usr/share/pkgconfig'
2153
[   43s] | PYTHON='/usr/bin/python'
2154
[   43s] | PYTHON_EXEC_PREFIX='${exec_prefix}'
2155
[   43s] | PYTHON_PLATFORM='linux2'
2156
[   43s] | PYTHON_PREFIX='${prefix}'
2157
[   43s] | PYTHON_VERSION='2.7'
2158
[   43s] | RANLIB='ranlib'
2159
[   43s] | SED='/usr/bin/sed'
2160
[   43s] | SET_MAKE=''
2161
[   43s] | SHELL='/bin/sh'
2162
[   43s] | STRIP='strip'
2163
[   43s] | SYMBOL_VISIBILITY='-fvisibility=hidden'
2164
[   43s] | VERSION='0.4.60'
2165
[   43s] | ac_ct_AR='ar'
2166
[   43s] | ac_ct_CC='gcc'
2167
[   43s] | ac_ct_DUMPBIN=''
2168
[   43s] | am__EXEEXT_FALSE=''
2169
[   43s] | am__EXEEXT_TRUE='#'
2170
[   43s] | am__fastdepCC_FALSE=''
2171
[   43s] | am__fastdepCC_TRUE='#'
2172
[   43s] | am__include='include'
2173
[   43s] | am__isrc=''
2174
[   43s] | am__leading_dot='.'
2175
[   43s] | am__nodep=''
2176
[   43s] | am__quote=''
2177
[   43s] | am__tar='$${TAR-tar} chof - "$$tardir"'
2178
[   43s] | am__untar='$${TAR-tar} xf -'
2179
[   43s] | bindir='/usr/bin'
2180
[   43s] | build='x86_64-suse-linux-gnu'
2181
[   43s] | build_alias='x86_64-suse-linux-gnu'
2182
[   43s] | build_cpu='x86_64'
2183
[   43s] | build_os='linux-gnu'
2184
[   43s] | build_vendor='suse'
2185
[   43s] | datadir='/usr/share'
2186
[   43s] | datarootdir='${prefix}/share'
2187
[   43s] | docdir='${datarootdir}/doc/${PACKAGE_TARNAME}'
2188
[   43s] | dvidir='${docdir}'
2189
[   43s] | exec_prefix='/usr'
2190
[   43s] | host='x86_64-suse-linux-gnu'
2191
[   43s] | host_alias='x86_64-suse-linux-gnu'
2192
[   43s] | host_cpu='x86_64'
2193
[   43s] | host_os='linux-gnu'
2194
[   43s] | host_vendor='suse'
2195
[   43s] | htmldir='${docdir}'
2196
[   43s] | includedir='/usr/include'
2197
[   43s] | infodir='/usr/share/info'
2198
[   43s] | install_sh='${SHELL} /home/abuild/rpmbuild/BUILD/gapk-0.4.60/install-sh'
2199
[   43s] | libdir='/usr/lib64'
2200
[   43s] | libexecdir='/usr/lib'
2201
[   43s] | localedir='${datarootdir}/locale'
2202
[   43s] | localstatedir='/var'
2203
[   43s] | mandir='/usr/share/man'
2204
[   43s] | mkdir_p='$(MKDIR_P)'
2205
[   43s] | oldincludedir='/usr/include'
2206
[   43s] | pdfdir='${docdir}'
2207
[   43s] | pkgpyexecdir='${pyexecdir}/gapk'
2208
[   43s] | pkgpythondir='${pythondir}/gapk'
2209
[   43s] | prefix='/usr'
2210
[   43s] | program_transform_name='s&^&&'
2211
[   43s] | psdir='${docdir}'
2212
[   43s] | pyexecdir='${exec_prefix}/lib64/python2.7/site-packages'
2213
[   43s] | pythondir='${prefix}/lib/python2.7/site-packages'
2214
[   43s] | sbindir='/usr/sbin'
2215
[   43s] | sharedstatedir='/var/lib'
2216
[   43s] | sysconfdir='/etc'
2217
[   43s] | target_alias=''
2218
[   43s] | 
2219
[   43s] | ## ----------- ##
2220
[   43s] | ## confdefs.h. ##
2221
[   43s] | ## ----------- ##
2222
[   43s] | 
2223
[   43s] | /* confdefs.h */
2224
[   43s] | #define PACKAGE_NAME "gapk"
2225
[   43s] | #define PACKAGE_TARNAME "gapk"
2226
[   43s] | #define PACKAGE_VERSION "0.4.60"
2227
[   43s] | #define PACKAGE_STRING "gapk 0.4.60"
2228
[   43s] | #define PACKAGE_BUGREPORT "openbsc@lists.osmocom.org"
2229
[   43s] | #define PACKAGE_URL ""
2230
[   43s] | #define PACKAGE "gapk"
2231
[   43s] | #define VERSION "0.4.60"
2232
[   43s] | #define STDC_HEADERS 1
2233
[   43s] | #define HAVE_SYS_TYPES_H 1
2234
[   43s] | #define HAVE_SYS_STAT_H 1
2235
[   43s] | #define HAVE_STDLIB_H 1
2236
[   43s] | #define HAVE_STRING_H 1
2237
[   43s] | #define HAVE_MEMORY_H 1
2238
[   43s] | #define HAVE_STRINGS_H 1
2239
[   43s] | #define HAVE_INTTYPES_H 1
2240
[   43s] | #define HAVE_STDINT_H 1
2241
[   43s] | #define HAVE_UNISTD_H 1
2242
[   43s] | #define HAVE_DLFCN_H 1
2243
[   43s] | #define LT_OBJDIR ".libs/"
2244
[   43s] | #define HAVE_LIBGSMHR 1
2245
[   43s] | #define HAVE_ALSA 1
2246
[   43s] | #define HAVE_OPENCORE_AMRNB 1
2247
[   43s] | #define HAVE_GSM_GSM_H 1
2248
[   43s] | #define HAVE_LIBGSM 1
2249
[   43s] | #define HAVE_STDINT_H 1
2250
[   43s] | #define HAVE_STDLIB_H 1
2251
[   43s] | #define HAVE_STRING_H 1
2252
[   43s] | #define HAVE_UNISTD_H 1
2253
[   43s] | #define HAVE_STDLIB_H 1
2254
[   43s] | #define HAVE_MALLOC 1
2255
[   43s] | #define HAVE_MEMSET 1
2256
[   43s] | 
2257
[   43s] | configure: exit 0
2258
[   43s] 
2259
[   43s] #                             -*- compilation -*-
2260
[   43s] 22. testsuite.at:224: testing conv/dec/ti_efr ...
2261
[   43s] ./testsuite.at:226: test "x$enable_amr_efr_tests" = xyes || exit 77
2262
[   43s] ./testsuite.at:228:
2263
[   43s] 	$abs_top_builddir/src/osmo-gapk \
2264
[   43s] 		-i $abs_srcdir/ref-files/hhgttg_part1_5.s16.ti-efr \
2265
[   43s] 		-f ti-efr -g rawpcm-s16le
2266
[   43s] 
2267
[   43s] stderr:
2268
[   43s] <0000> app_osmo_gapk.c:405 Opening I/O streams
2269
[   43s] <0000> app_osmo_gapk.c:408 Using a file as source
2270
[   43s] <0000> app_osmo_gapk.c:457 Using stdout as sink
2271
[   43s] <0000> app_osmo_gapk.c:526 Creating a processing queue
2272
[   43s] <0000> app_osmo_gapk.c:777 Init complete, starting processing queue...
2273
[   43s] <0000> procqueue.c:204 PQ 'main': execution aborted: item 'source/file' returned -1
2274
[   43s] <0000> app_osmo_gapk.c:655 Processed 250 frames
2275
[   43s] <0000> app_osmo_gapk.c:467 Closing I/O streams
2276
[   43s] Binary files expout and /home/abuild/rpmbuild/BUILD/gapk-0.4.60/tests/testsuite.dir/at-groups/22/stdout differ
2277
[   43s] 22. testsuite.at:224: 22. conv/dec/ti_efr (testsuite.at:224): FAILED (testsuite.at:228)
2278
[   43s] #                             -*- compilation -*-
2279
[   43s] 14. testsuite.at:136: testing conv/enc/rtp_hr_ietf ...
2280
[   43s] ./testsuite.at:138: test "x$enable_hr_tests" = xyes || exit 77
2281
[   43s] ./testsuite.at:140:
2282
[   43s] 	$abs_top_builddir/src/osmo-gapk \
2283
[   43s] 		-i $abs_srcdir/ref-files/hhgttg_part1_5.s16 \
2284
[   43s] 		-f rawpcm-s16le -g rtp-hr-ietf
2285
[   43s] 
2286
[   43s] stderr:
2287
[   43s] <0000> app_osmo_gapk.c:405 Opening I/O streams
2288
[   43s] <0000> app_osmo_gapk.c:408 Using a file as source
2289
[   43s] <0000> app_osmo_gapk.c:457 Using stdout as sink
2290
[   43s] <0000> app_osmo_gapk.c:526 Creating a processing queue
2291
[   43s] <0000> app_osmo_gapk.c:777 Init complete, starting processing queue...
2292
[   43s] <0000> procqueue.c:204 PQ 'main': execution aborted: item 'source/file' returned -1
2293
[   43s] <0000> app_osmo_gapk.c:655 Processed 250 frames
2294
[   43s] <0000> app_osmo_gapk.c:467 Closing I/O streams
2295
[   43s] Binary files expout and /home/abuild/rpmbuild/BUILD/gapk-0.4.60/tests/testsuite.dir/at-groups/14/stdout differ
2296
[   43s] 14. testsuite.at:136: 14. conv/enc/rtp_hr_ietf (testsuite.at:136): FAILED (testsuite.at:140)
2297
[   43s] #                             -*- compilation -*-
2298
[   43s] 13. testsuite.at:125: testing conv/enc/rtp_hr_etsi ...
2299
[   43s] ./testsuite.at:127: test "x$enable_hr_tests" = xyes || exit 77
2300
[   43s] ./testsuite.at:129:
2301
[   43s] 	$abs_top_builddir/src/osmo-gapk \
2302
[   43s] 		-i $abs_srcdir/ref-files/hhgttg_part1_5.s16 \
2303
[   43s] 		-f rawpcm-s16le -g rtp-hr-etsi
2304
[   43s] 
2305
[   43s] stderr:
2306
[   43s] <0000> app_osmo_gapk.c:405 Opening I/O streams
2307
[   43s] <0000> app_osmo_gapk.c:408 Using a file as source
2308
[   43s] <0000> app_osmo_gapk.c:457 Using stdout as sink
2309
[   43s] <0000> app_osmo_gapk.c:526 Creating a processing queue
2310
[   43s] <0000> app_osmo_gapk.c:777 Init complete, starting processing queue...
2311
[   43s] <0000> procqueue.c:204 PQ 'main': execution aborted: item 'source/file' returned -1
2312
[   43s] <0000> app_osmo_gapk.c:655 Processed 250 frames
2313
[   43s] <0000> app_osmo_gapk.c:467 Closing I/O streams
2314
[   43s] Binary files expout and /home/abuild/rpmbuild/BUILD/gapk-0.4.60/tests/testsuite.dir/at-groups/13/stdout differ
2315
[   43s] 13. testsuite.at:125: 13. conv/enc/rtp_hr_etsi (testsuite.at:125): FAILED (testsuite.at:129)
2316
[   43s] #                             -*- compilation -*-
2317
[   43s] 6. testsuite.at:48: testing conv/enc/racal_hr ...
2318
[   43s] ./testsuite.at:50: test "x$enable_hr_tests" = xyes || exit 77
2319
[   43s] ./testsuite.at:52:
2320
[   43s] 	$abs_top_builddir/src/osmo-gapk \
2321
[   43s] 		-i $abs_srcdir/ref-files/hhgttg_part1_5.s16 \
2322
[   43s] 		-f rawpcm-s16le -g racal-hr
2323
[   43s] 
2324
[   43s] stderr:
2325
[   43s] <0000> app_osmo_gapk.c:405 Opening I/O streams
2326
[   43s] <0000> app_osmo_gapk.c:408 Using a file as source
2327
[   43s] <0000> app_osmo_gapk.c:457 Using stdout as sink
2328
[   43s] <0000> app_osmo_gapk.c:526 Creating a processing queue
2329
[   43s] <0000> app_osmo_gapk.c:777 Init complete, starting processing queue...
2330
[   43s] <0000> procqueue.c:204 PQ 'main': execution aborted: item 'source/file' returned -1
2331
[   43s] <0000> app_osmo_gapk.c:655 Processed 250 frames
2332
[   43s] <0000> app_osmo_gapk.c:467 Closing I/O streams
2333
[   43s] Binary files expout and /home/abuild/rpmbuild/BUILD/gapk-0.4.60/tests/testsuite.dir/at-groups/6/stdout differ
2334
[   43s] 6. testsuite.at:48: 6. conv/enc/racal_hr (testsuite.at:48): FAILED (testsuite.at:52)
2335
[   43s] #                             -*- compilation -*-
2336
[   43s] 9. testsuite.at:81: testing conv/enc/ti_hr ...
2337
[   43s] ./testsuite.at:83: test "x$enable_hr_tests" = xyes || exit 77
2338
[   43s] ./testsuite.at:85:
2339
[   43s] 	$abs_top_builddir/src/osmo-gapk \
2340
[   43s] 		-i $abs_srcdir/ref-files/hhgttg_part1_5.s16 \
2341
[   43s] 		-f rawpcm-s16le -g ti-hr
2342
[   43s] 
2343
[   43s] stderr:
2344
[   43s] <0000> app_osmo_gapk.c:405 Opening I/O streams
2345
[   43s] <0000> app_osmo_gapk.c:408 Using a file as source
2346
[   43s] <0000> app_osmo_gapk.c:457 Using stdout as sink
2347
[   43s] <0000> app_osmo_gapk.c:526 Creating a processing queue
2348
[   43s] <0000> app_osmo_gapk.c:777 Init complete, starting processing queue...
2349
[   43s] <0000> procqueue.c:204 PQ 'main': execution aborted: item 'source/file' returned -1
2350
[   43s] <0000> app_osmo_gapk.c:655 Processed 250 frames
2351
[   43s] <0000> app_osmo_gapk.c:467 Closing I/O streams
2352
[   43s] Binary files expout and /home/abuild/rpmbuild/BUILD/gapk-0.4.60/tests/testsuite.dir/at-groups/9/stdout differ
2353
[   43s] 9. testsuite.at:81: 9. conv/enc/ti_hr (testsuite.at:81): FAILED (testsuite.at:85)
2354
[   43s] + false
2355
[   43s] error: Bad exit status from /var/tmp/rpm-tmp.cvPbtR (%check)
2356
[   43s] 
2357
[   43s] 
2358
[   43s] RPM build errors:
2359
[   43s]     Bad exit status from /var/tmp/rpm-tmp.cvPbtR (%check)
2360
[   43s] 
2361
[   43s] build-new failed "build gapk.spec" at Mon Feb 12 19:06:43 UTC 2018.
2362
[   43s] 
Add picture from clipboard (Maximum size: 48.8 MB)