Project

General

Profile

buildFailed.txt

xexzy, 02/01/2019 09:06 PM

 
1
user@xdr:~/sdr/src$ git clone https://git.osmocom.org/op25
2
Cloning into 'op25'...
3
user@xdr:~/sdr/src$ cd op25/
4
user@xdr:~/sdr/src/op25$ ./install.sh 
5
Hit:1 http://us.archive.ubuntu.com/ubuntu bionic InRelease
6
Get:2 http://us.archive.ubuntu.com/ubuntu bionic-updates InRelease [88.7 kB]          
7
Get:3 http://us.archive.ubuntu.com/ubuntu bionic-backports InRelease [74.6 kB]                   
8
Get:4 http://security.ubuntu.com/ubuntu bionic-security InRelease [88.7 kB]                       
9
Fetched 252 kB in 2s (126 kB/s)       
10
Reading package lists... Done
11
Reading package lists... Done
12
E: You must put some 'source' URIs in your sources.list
13
Reading package lists... Done
14
Building dependency tree       
15
Reading state information... Done
16
build-essential is already the newest version (12.4ubuntu1).
17
cmake is already the newest version (3.10.2-1ubuntu2).
18
doxygen is already the newest version (1.8.13-10).
19
libpcap-dev is already the newest version (1.8.1-6ubuntu1).
20
pkg-config is already the newest version (0.29.1-0ubuntu2).
21
gnuradio is already the newest version (3.7.11-10).
22
gnuradio-dev is already the newest version (3.7.11-10).
23
gr-osmosdr is already the newest version (0.1.4-14build1).
24
libhackrf-dev is already the newest version (2018.01.1-2).
25
libitpp-dev is already the newest version (4.3.1-8).
26
librtlsdr-dev is already the newest version (0.5.3-13).
27
libuhd-dev is already the newest version (3.10.3.0-2).
28
swig is already the newest version (3.0.12-1).
29
git is already the newest version (1:2.17.1-1ubuntu0.4).
30
The following packages were automatically installed and are no longer required:
31
  x11proto-dri2-dev x11proto-gl-dev
32
Use 'sudo apt autoremove' to remove them.
33
0 upgraded, 0 newly installed, 0 to remove and 0 not upgraded.
34
-- The CXX compiler identification is GNU 7.3.0
35
-- The C compiler identification is GNU 7.3.0
36
-- Check for working CXX compiler: /usr/bin/c++
37
-- Check for working CXX compiler: /usr/bin/c++ -- works
38
-- Detecting CXX compiler ABI info
39
-- Detecting CXX compiler ABI info - done
40
-- Detecting CXX compile features
41
-- Detecting CXX compile features - done
42
-- Check for working C compiler: /usr/bin/cc
43
-- Check for working C compiler: /usr/bin/cc -- works
44
-- Detecting C compiler ABI info
45
-- Detecting C compiler ABI info - done
46
-- Detecting C compile features
47
-- Detecting C compile features - done
48
-- Build type not specified: defaulting to release.
49
-- Boost version: 1.65.1
50
-- Found the following Boost libraries:
51
--   filesystem
52
--   system
53
-- Found PkgConfig: /usr/bin/pkg-config (found version "0.29.1") 
54
-- Checking for module 'gnuradio-runtime'
55
--   Found gnuradio-runtime, version 3.7.13.4
56
-- Found GNURADIO_RUNTIME: /home/user/sdr/lib/libgnuradio-runtime.so  
57
-- Checking for module 'cppunit'
58
--   Found cppunit, version 1.14.0
59
-- Found CPPUNIT: /usr/lib/x86_64-linux-gnu/libcppunit.so;dl  
60
-- Found SWIG: /usr/bin/swig3.0 (found version "3.0.12") 
61
-- Found PythonLibs: /usr/lib/x86_64-linux-gnu/libpython2.7.so (found suitable version "2.7.15rc1", minimum required is "2") 
62
CMake Warning (dev) at cmake/Modules/GrPython.cmake:196:
63
  Syntax Warning in cmake code at column 44
64

    
65
  Argument not separated from preceding token by whitespace.
66
Call Stack (most recent call first):
67
  cmake/Modules/GrSwig.cmake:25 (include)
68
  op25/gr-op25/swig/CMakeLists.txt:28 (include)
69
This warning is for project developers.  Use -Wno-dev to suppress it.
70

    
71
CMake Warning (dev) at cmake/Modules/GrPython.cmake:196:
72
  Syntax Warning in cmake code at column 92
73

    
74
  Argument not separated from preceding token by whitespace.
75
Call Stack (most recent call first):
76
  cmake/Modules/GrSwig.cmake:25 (include)
77
  op25/gr-op25/swig/CMakeLists.txt:28 (include)
78
This warning is for project developers.  Use -Wno-dev to suppress it.
79

    
80
CMake Warning (dev) at cmake/Modules/GrPython.cmake:196:
81
  Syntax Warning in cmake code at column 100
82

    
83
  Argument not separated from preceding token by whitespace.
84
Call Stack (most recent call first):
85
  cmake/Modules/GrSwig.cmake:25 (include)
86
  op25/gr-op25/swig/CMakeLists.txt:28 (include)
87
This warning is for project developers.  Use -Wno-dev to suppress it.
88

    
89
-- Found PythonInterp: /usr/bin/python2 (found suitable version "2.7.15", minimum required is "2") 
90
CMake Warning (dev) at cmake/Modules/GrPython.cmake:196:
91
  Syntax Warning in cmake code at column 44
92

    
93
  Argument not separated from preceding token by whitespace.
94
Call Stack (most recent call first):
95
  op25/gr-op25/swig/CMakeLists.txt:29 (include)
96
This warning is for project developers.  Use -Wno-dev to suppress it.
97

    
98
CMake Warning (dev) at cmake/Modules/GrPython.cmake:196:
99
  Syntax Warning in cmake code at column 92
100

    
101
  Argument not separated from preceding token by whitespace.
102
Call Stack (most recent call first):
103
  op25/gr-op25/swig/CMakeLists.txt:29 (include)
104
This warning is for project developers.  Use -Wno-dev to suppress it.
105

    
106
CMake Warning (dev) at cmake/Modules/GrPython.cmake:196:
107
  Syntax Warning in cmake code at column 100
108

    
109
  Argument not separated from preceding token by whitespace.
110
Call Stack (most recent call first):
111
  op25/gr-op25/swig/CMakeLists.txt:29 (include)
112
This warning is for project developers.  Use -Wno-dev to suppress it.
113

    
114
-- Found Doxygen: /usr/bin/doxygen (found version "1.8.13") found components:  doxygen missing components:  dot
115
CMake Deprecation Warning at /usr/share/cmake-3.10/Modules/UseSWIG.cmake:231 (message):
116
  SWIG_ADD_MODULE is deprecated.  Use SWIG_ADD_LIBRARY instead.
117
Call Stack (most recent call first):
118
  cmake/Modules/GrSwig.cmake:158 (SWIG_ADD_MODULE)
119
  op25/gr-op25/swig/CMakeLists.txt:42 (GR_SWIG_MAKE)
120

    
121

    
122
CMake Warning (dev) at cmake/Modules/GrPython.cmake:196:
123
  Syntax Warning in cmake code at column 44
124

    
125
  Argument not separated from preceding token by whitespace.
126
Call Stack (most recent call first):
127
  cmake/Modules/GrSwig.cmake:182 (include)
128
  op25/gr-op25/swig/CMakeLists.txt:47 (GR_SWIG_INSTALL)
129
This warning is for project developers.  Use -Wno-dev to suppress it.
130

    
131
CMake Warning (dev) at cmake/Modules/GrPython.cmake:196:
132
  Syntax Warning in cmake code at column 92
133

    
134
  Argument not separated from preceding token by whitespace.
135
Call Stack (most recent call first):
136
  cmake/Modules/GrSwig.cmake:182 (include)
137
  op25/gr-op25/swig/CMakeLists.txt:47 (GR_SWIG_INSTALL)
138
This warning is for project developers.  Use -Wno-dev to suppress it.
139

    
140
CMake Warning (dev) at cmake/Modules/GrPython.cmake:196:
141
  Syntax Warning in cmake code at column 100
142

    
143
  Argument not separated from preceding token by whitespace.
144
Call Stack (most recent call first):
145
  cmake/Modules/GrSwig.cmake:182 (include)
146
  op25/gr-op25/swig/CMakeLists.txt:47 (GR_SWIG_INSTALL)
147
This warning is for project developers.  Use -Wno-dev to suppress it.
148

    
149
CMake Warning (dev) at cmake/Modules/GrPython.cmake:196:
150
  Syntax Warning in cmake code at column 44
151

    
152
  Argument not separated from preceding token by whitespace.
153
Call Stack (most recent call first):
154
  op25/gr-op25/python/CMakeLists.txt:23 (include)
155
This warning is for project developers.  Use -Wno-dev to suppress it.
156

    
157
CMake Warning (dev) at cmake/Modules/GrPython.cmake:196:
158
  Syntax Warning in cmake code at column 92
159

    
160
  Argument not separated from preceding token by whitespace.
161
Call Stack (most recent call first):
162
  op25/gr-op25/python/CMakeLists.txt:23 (include)
163
This warning is for project developers.  Use -Wno-dev to suppress it.
164

    
165
CMake Warning (dev) at cmake/Modules/GrPython.cmake:196:
166
  Syntax Warning in cmake code at column 100
167

    
168
  Argument not separated from preceding token by whitespace.
169
Call Stack (most recent call first):
170
  op25/gr-op25/python/CMakeLists.txt:23 (include)
171
This warning is for project developers.  Use -Wno-dev to suppress it.
172

    
173
CMake Warning (dev) at cmake/Modules/GrPython.cmake:196:
174
  Syntax Warning in cmake code at column 44
175

    
176
  Argument not separated from preceding token by whitespace.
177
Call Stack (most recent call first):
178
  op25/gr-op25/apps/CMakeLists.txt:20 (include)
179
This warning is for project developers.  Use -Wno-dev to suppress it.
180

    
181
CMake Warning (dev) at cmake/Modules/GrPython.cmake:196:
182
  Syntax Warning in cmake code at column 92
183

    
184
  Argument not separated from preceding token by whitespace.
185
Call Stack (most recent call first):
186
  op25/gr-op25/apps/CMakeLists.txt:20 (include)
187
This warning is for project developers.  Use -Wno-dev to suppress it.
188

    
189
CMake Warning (dev) at cmake/Modules/GrPython.cmake:196:
190
  Syntax Warning in cmake code at column 100
191

    
192
  Argument not separated from preceding token by whitespace.
193
Call Stack (most recent call first):
194
  op25/gr-op25/apps/CMakeLists.txt:20 (include)
195
This warning is for project developers.  Use -Wno-dev to suppress it.
196

    
197
-- Build type not specified: defaulting to release.
198
-- Boost version: 1.65.1
199
-- Found the following Boost libraries:
200
--   filesystem
201
--   system
202
CMake Warning (dev) at cmake/Modules/GrPython.cmake:196:
203
  Syntax Warning in cmake code at column 44
204

    
205
  Argument not separated from preceding token by whitespace.
206
Call Stack (most recent call first):
207
  cmake/Modules/GrSwig.cmake:25 (include)
208
  op25/gr-op25_repeater/swig/CMakeLists.txt:28 (include)
209
This warning is for project developers.  Use -Wno-dev to suppress it.
210

    
211
CMake Warning (dev) at cmake/Modules/GrPython.cmake:196:
212
  Syntax Warning in cmake code at column 92
213

    
214
  Argument not separated from preceding token by whitespace.
215
Call Stack (most recent call first):
216
  cmake/Modules/GrSwig.cmake:25 (include)
217
  op25/gr-op25_repeater/swig/CMakeLists.txt:28 (include)
218
This warning is for project developers.  Use -Wno-dev to suppress it.
219

    
220
CMake Warning (dev) at cmake/Modules/GrPython.cmake:196:
221
  Syntax Warning in cmake code at column 100
222

    
223
  Argument not separated from preceding token by whitespace.
224
Call Stack (most recent call first):
225
  cmake/Modules/GrSwig.cmake:25 (include)
226
  op25/gr-op25_repeater/swig/CMakeLists.txt:28 (include)
227
This warning is for project developers.  Use -Wno-dev to suppress it.
228

    
229
CMake Warning (dev) at cmake/Modules/GrPython.cmake:196:
230
  Syntax Warning in cmake code at column 44
231

    
232
  Argument not separated from preceding token by whitespace.
233
Call Stack (most recent call first):
234
  op25/gr-op25_repeater/swig/CMakeLists.txt:29 (include)
235
This warning is for project developers.  Use -Wno-dev to suppress it.
236

    
237
CMake Warning (dev) at cmake/Modules/GrPython.cmake:196:
238
  Syntax Warning in cmake code at column 92
239

    
240
  Argument not separated from preceding token by whitespace.
241
Call Stack (most recent call first):
242
  op25/gr-op25_repeater/swig/CMakeLists.txt:29 (include)
243
This warning is for project developers.  Use -Wno-dev to suppress it.
244

    
245
CMake Warning (dev) at cmake/Modules/GrPython.cmake:196:
246
  Syntax Warning in cmake code at column 100
247

    
248
  Argument not separated from preceding token by whitespace.
249
Call Stack (most recent call first):
250
  op25/gr-op25_repeater/swig/CMakeLists.txt:29 (include)
251
This warning is for project developers.  Use -Wno-dev to suppress it.
252

    
253
CMake Deprecation Warning at /usr/share/cmake-3.10/Modules/UseSWIG.cmake:231 (message):
254
  SWIG_ADD_MODULE is deprecated.  Use SWIG_ADD_LIBRARY instead.
255
Call Stack (most recent call first):
256
  cmake/Modules/GrSwig.cmake:158 (SWIG_ADD_MODULE)
257
  op25/gr-op25_repeater/swig/CMakeLists.txt:42 (GR_SWIG_MAKE)
258

    
259

    
260
CMake Warning (dev) at cmake/Modules/GrPython.cmake:196:
261
  Syntax Warning in cmake code at column 44
262

    
263
  Argument not separated from preceding token by whitespace.
264
Call Stack (most recent call first):
265
  cmake/Modules/GrSwig.cmake:182 (include)
266
  op25/gr-op25_repeater/swig/CMakeLists.txt:47 (GR_SWIG_INSTALL)
267
This warning is for project developers.  Use -Wno-dev to suppress it.
268

    
269
CMake Warning (dev) at cmake/Modules/GrPython.cmake:196:
270
  Syntax Warning in cmake code at column 92
271

    
272
  Argument not separated from preceding token by whitespace.
273
Call Stack (most recent call first):
274
  cmake/Modules/GrSwig.cmake:182 (include)
275
  op25/gr-op25_repeater/swig/CMakeLists.txt:47 (GR_SWIG_INSTALL)
276
This warning is for project developers.  Use -Wno-dev to suppress it.
277

    
278
CMake Warning (dev) at cmake/Modules/GrPython.cmake:196:
279
  Syntax Warning in cmake code at column 100
280

    
281
  Argument not separated from preceding token by whitespace.
282
Call Stack (most recent call first):
283
  cmake/Modules/GrSwig.cmake:182 (include)
284
  op25/gr-op25_repeater/swig/CMakeLists.txt:47 (GR_SWIG_INSTALL)
285
This warning is for project developers.  Use -Wno-dev to suppress it.
286

    
287
CMake Warning (dev) at cmake/Modules/GrPython.cmake:196:
288
  Syntax Warning in cmake code at column 44
289

    
290
  Argument not separated from preceding token by whitespace.
291
Call Stack (most recent call first):
292
  op25/gr-op25_repeater/python/CMakeLists.txt:23 (include)
293
This warning is for project developers.  Use -Wno-dev to suppress it.
294

    
295
CMake Warning (dev) at cmake/Modules/GrPython.cmake:196:
296
  Syntax Warning in cmake code at column 92
297

    
298
  Argument not separated from preceding token by whitespace.
299
Call Stack (most recent call first):
300
  op25/gr-op25_repeater/python/CMakeLists.txt:23 (include)
301
This warning is for project developers.  Use -Wno-dev to suppress it.
302

    
303
CMake Warning (dev) at cmake/Modules/GrPython.cmake:196:
304
  Syntax Warning in cmake code at column 100
305

    
306
  Argument not separated from preceding token by whitespace.
307
Call Stack (most recent call first):
308
  op25/gr-op25_repeater/python/CMakeLists.txt:23 (include)
309
This warning is for project developers.  Use -Wno-dev to suppress it.
310

    
311
CMake Warning (dev) at cmake/Modules/GrPython.cmake:196:
312
  Syntax Warning in cmake code at column 44
313

    
314
  Argument not separated from preceding token by whitespace.
315
Call Stack (most recent call first):
316
  op25/gr-op25_repeater/apps/CMakeLists.txt:20 (include)
317
This warning is for project developers.  Use -Wno-dev to suppress it.
318

    
319
CMake Warning (dev) at cmake/Modules/GrPython.cmake:196:
320
  Syntax Warning in cmake code at column 92
321

    
322
  Argument not separated from preceding token by whitespace.
323
Call Stack (most recent call first):
324
  op25/gr-op25_repeater/apps/CMakeLists.txt:20 (include)
325
This warning is for project developers.  Use -Wno-dev to suppress it.
326

    
327
CMake Warning (dev) at cmake/Modules/GrPython.cmake:196:
328
  Syntax Warning in cmake code at column 100
329

    
330
  Argument not separated from preceding token by whitespace.
331
Call Stack (most recent call first):
332
  op25/gr-op25_repeater/apps/CMakeLists.txt:20 (include)
333
This warning is for project developers.  Use -Wno-dev to suppress it.
334

    
335
-- Configuring done
336
-- Generating done
337
-- Build files have been written to: /home/user/sdr/src/op25/build
338
Scanning dependencies of target gnuradio-op25
339
[  1%] Building CXX object op25/gr-op25/lib/CMakeFiles/gnuradio-op25.dir/fsk4_demod_ff_impl.cc.o
340
[  2%] Building CXX object op25/gr-op25/lib/CMakeFiles/gnuradio-op25.dir/fsk4_slicer_fb_impl.cc.o
341
[  3%] Building CXX object op25/gr-op25/lib/CMakeFiles/gnuradio-op25.dir/decoder_bf_impl.cc.o
342
[  4%] Building CXX object op25/gr-op25/lib/CMakeFiles/gnuradio-op25.dir/decoder_ff_impl.cc.o
343
[  5%] Building CXX object op25/gr-op25/lib/CMakeFiles/gnuradio-op25.dir/abstract_data_unit.cc.o
344
[  5%] Building CXX object op25/gr-op25/lib/CMakeFiles/gnuradio-op25.dir/data_unit.cc.o
345
[  6%] Building CXX object op25/gr-op25/lib/CMakeFiles/gnuradio-op25.dir/hdu.cc.o
346
[  7%] Building CXX object op25/gr-op25/lib/CMakeFiles/gnuradio-op25.dir/ldu1.cc.o
347
[  8%] Building CXX object op25/gr-op25/lib/CMakeFiles/gnuradio-op25.dir/ldu2.cc.o
348
[  9%] Building CXX object op25/gr-op25/lib/CMakeFiles/gnuradio-op25.dir/pdu.cc.o
349
[ 10%] Building CXX object op25/gr-op25/lib/CMakeFiles/gnuradio-op25.dir/tdu.cc.o
350
[ 10%] Building CXX object op25/gr-op25/lib/CMakeFiles/gnuradio-op25.dir/tsbk.cc.o
351
[ 11%] Building CXX object op25/gr-op25/lib/CMakeFiles/gnuradio-op25.dir/data_unit_handler.cc.o
352
[ 12%] Building CXX object op25/gr-op25/lib/CMakeFiles/gnuradio-op25.dir/logfile_du_handler.cc.o
353
[ 13%] Building CXX object op25/gr-op25/lib/CMakeFiles/gnuradio-op25.dir/p25cai_du_handler.cc.o
354
/home/user/sdr/src/op25/op25/gr-op25/lib/p25cai_du_handler.cc: In member function ‘virtual void p25cai_du_handler::handle(data_unit_sptr)’:
355
/home/user/sdr/src/op25/op25/gr-op25/lib/p25cai_du_handler.cc:85:12: warning: ignoring return value of ‘ssize_t write(int, const void*, size_t)’, declared with attribute warn_unused_result [-Wunused-result]
356
       write(d_cai, cai, CAI_SZ);
357
       ~~~~~^~~~~~~~~~~~~~~~~~~~
358
[ 14%] Building CXX object op25/gr-op25/lib/CMakeFiles/gnuradio-op25.dir/snapshot_du_handler.cc.o
359
[ 15%] Building CXX object op25/gr-op25/lib/CMakeFiles/gnuradio-op25.dir/imbe_decoder.cc.o
360
[ 15%] Building CXX object op25/gr-op25/lib/CMakeFiles/gnuradio-op25.dir/imbe_decoder_factory.cc.o
361
[ 16%] Building CXX object op25/gr-op25/lib/CMakeFiles/gnuradio-op25.dir/dummy_imbe_decoder.cc.o
362
[ 17%] Building CXX object op25/gr-op25/lib/CMakeFiles/gnuradio-op25.dir/offline_imbe_decoder.cc.o
363
[ 18%] Building CXX object op25/gr-op25/lib/CMakeFiles/gnuradio-op25.dir/voice_data_unit.cc.o
364
[ 19%] Building CXX object op25/gr-op25/lib/CMakeFiles/gnuradio-op25.dir/voice_du_handler.cc.o
365
[ 20%] Building CXX object op25/gr-op25/lib/CMakeFiles/gnuradio-op25.dir/pcap_source_b_impl.cc.o
366
[ 20%] Building CXX object op25/gr-op25/lib/CMakeFiles/gnuradio-op25.dir/software_imbe_decoder.cc.o
367
[ 21%] Building CXX object op25/gr-op25/lib/CMakeFiles/gnuradio-op25.dir/vc55_imbe_decoder.cc.o
368
[ 22%] Building CXX object op25/gr-op25/lib/CMakeFiles/gnuradio-op25.dir/value_string.cc.o
369
[ 23%] Building CXX object op25/gr-op25/lib/CMakeFiles/gnuradio-op25.dir/pickle.cc.o
370
[ 24%] Linking CXX shared library libgnuradio-op25.so
371
[ 24%] Built target gnuradio-op25
372
Scanning dependencies of target test-op25
373
[ 25%] Building CXX object op25/gr-op25/lib/CMakeFiles/test-op25.dir/test_op25.cc.o
374
[ 26%] Building CXX object op25/gr-op25/lib/CMakeFiles/test-op25.dir/qa_op25.cc.o
375
[ 27%] Linking CXX executable test-op25
376
[ 27%] Built target test-op25
377
Scanning dependencies of target _op25_swig_swig_tag
378
[ 27%] Building CXX object op25/gr-op25/swig/CMakeFiles/_op25_swig_swig_tag.dir/_op25_swig_swig_tag.cpp.o
379
[ 28%] Linking CXX executable _op25_swig_swig_tag
380
[ 28%] Built target _op25_swig_swig_tag
381
Scanning dependencies of target _op25_swig_doc_tag
382
[ 29%] Building CXX object op25/gr-op25/swig/CMakeFiles/_op25_swig_doc_tag.dir/_op25_swig_doc_tag.cpp.o
383
[ 30%] Linking CXX executable _op25_swig_doc_tag
384
[ 30%] Built target _op25_swig_doc_tag
385
[ 31%] Generating doxygen xml for op25_swig_doc docs
386
warning: Tag `SYMBOL_CACHE_SIZE' at line 289 of file `/home/user/sdr/src/op25/build/op25/gr-op25/swig/op25_swig_doc_swig_docs/Doxyfile' has become obsolete.
387
         To avoid this warning please remove this line from your configuration file or upgrade it using "doxygen -u"
388
warning: Tag `SHOW_DIRECTORIES' at line 477 of file `/home/user/sdr/src/op25/build/op25/gr-op25/swig/op25_swig_doc_swig_docs/Doxyfile' has become obsolete.
389
         To avoid this warning please remove this line from your configuration file or upgrade it using "doxygen -u"
390
warning: Tag `HTML_ALIGN_MEMBERS' at line 803 of file `/home/user/sdr/src/op25/build/op25/gr-op25/swig/op25_swig_doc_swig_docs/Doxyfile' has become obsolete.
391
         To avoid this warning please remove this line from your configuration file or upgrade it using "doxygen -u"
392
warning: Tag `USE_INLINE_TREES' at line 956 of file `/home/user/sdr/src/op25/build/op25/gr-op25/swig/op25_swig_doc_swig_docs/Doxyfile' has become obsolete.
393
         To avoid this warning please remove this line from your configuration file or upgrade it using "doxygen -u"
394
warning: Tag `XML_SCHEMA' at line 1149 of file `/home/user/sdr/src/op25/build/op25/gr-op25/swig/op25_swig_doc_swig_docs/Doxyfile' has become obsolete.
395
         To avoid this warning please remove this line from your configuration file or upgrade it using "doxygen -u"
396
warning: Tag `XML_DTD' at line 1155 of file `/home/user/sdr/src/op25/build/op25/gr-op25/swig/op25_swig_doc_swig_docs/Doxyfile' has become obsolete.
397
         To avoid this warning please remove this line from your configuration file or upgrade it using "doxygen -u"
398
warning: doxygen no longer ships with the FreeSans font.
399
You may want to clear or change DOT_FONTNAME.
400
Otherwise you run the risk that the wrong font is being used for dot generated graphs.
401
[ 31%] Generating op25_swig_doc.i
402
[ 32%] Generating op25_swig.tag
403
[ 33%] Swig source
404
Scanning dependencies of target _op25_swig
405
[ 34%] Building CXX object op25/gr-op25/swig/CMakeFiles/_op25_swig.dir/op25_swigPYTHON_wrap.cxx.o
406
[ 35%] Linking CXX shared module _op25_swig.so
407
[ 35%] Built target _op25_swig
408
Scanning dependencies of target pygen_op25_gr_op25_swig_816d0
409
[ 36%] Generating op25_swig.pyc
410
[ 37%] Generating op25_swig.pyo
411
[ 40%] Built target pygen_op25_gr_op25_swig_816d0
412
Scanning dependencies of target pygen_op25_gr_op25_python_9989f
413
[ 41%] Generating __init__.pyc
414
[ 42%] Generating __init__.pyo
415
[ 42%] Built target pygen_op25_gr_op25_python_9989f
416
Scanning dependencies of target pygen_op25_gr_op25_apps_383eb
417
[ 42%] Built target pygen_op25_gr_op25_apps_383eb
418
Scanning dependencies of target imbe_vocoder
419
[ 43%] Building CXX object op25/gr-op25_repeater/lib/imbe_vocoder/CMakeFiles/imbe_vocoder.dir/aux_sub.cc.o
420
[ 43%] Building CXX object op25/gr-op25_repeater/lib/imbe_vocoder/CMakeFiles/imbe_vocoder.dir/basicop2.cc.o
421
[ 44%] Building CXX object op25/gr-op25_repeater/lib/imbe_vocoder/CMakeFiles/imbe_vocoder.dir/ch_decode.cc.o
422
[ 45%] Building CXX object op25/gr-op25_repeater/lib/imbe_vocoder/CMakeFiles/imbe_vocoder.dir/ch_encode.cc.o
423
[ 46%] Building CXX object op25/gr-op25_repeater/lib/imbe_vocoder/CMakeFiles/imbe_vocoder.dir/dc_rmv.cc.o
424
[ 47%] Building CXX object op25/gr-op25_repeater/lib/imbe_vocoder/CMakeFiles/imbe_vocoder.dir/decode.cc.o
425
[ 48%] Building CXX object op25/gr-op25_repeater/lib/imbe_vocoder/CMakeFiles/imbe_vocoder.dir/dsp_sub.cc.o
426
[ 48%] Building CXX object op25/gr-op25_repeater/lib/imbe_vocoder/CMakeFiles/imbe_vocoder.dir/encode.cc.o
427
[ 49%] Building CXX object op25/gr-op25_repeater/lib/imbe_vocoder/CMakeFiles/imbe_vocoder.dir/imbe_vocoder.cc.o
428
[ 50%] Building CXX object op25/gr-op25_repeater/lib/imbe_vocoder/CMakeFiles/imbe_vocoder.dir/math_sub.cc.o
429
[ 51%] Building CXX object op25/gr-op25_repeater/lib/imbe_vocoder/CMakeFiles/imbe_vocoder.dir/pe_lpf.cc.o
430
[ 52%] Building CXX object op25/gr-op25_repeater/lib/imbe_vocoder/CMakeFiles/imbe_vocoder.dir/pitch_est.cc.o
431
[ 53%] Building CXX object op25/gr-op25_repeater/lib/imbe_vocoder/CMakeFiles/imbe_vocoder.dir/pitch_ref.cc.o
432
[ 53%] Building CXX object op25/gr-op25_repeater/lib/imbe_vocoder/CMakeFiles/imbe_vocoder.dir/qnt_sub.cc.o
433
[ 54%] Building CXX object op25/gr-op25_repeater/lib/imbe_vocoder/CMakeFiles/imbe_vocoder.dir/rand_gen.cc.o
434
[ 55%] Building CXX object op25/gr-op25_repeater/lib/imbe_vocoder/CMakeFiles/imbe_vocoder.dir/sa_decode.cc.o
435
[ 56%] Building CXX object op25/gr-op25_repeater/lib/imbe_vocoder/CMakeFiles/imbe_vocoder.dir/sa_encode.cc.o
436
[ 57%] Building CXX object op25/gr-op25_repeater/lib/imbe_vocoder/CMakeFiles/imbe_vocoder.dir/sa_enh.cc.o
437
[ 58%] Building CXX object op25/gr-op25_repeater/lib/imbe_vocoder/CMakeFiles/imbe_vocoder.dir/tbls.cc.o
438
[ 58%] Building CXX object op25/gr-op25_repeater/lib/imbe_vocoder/CMakeFiles/imbe_vocoder.dir/uv_synt.cc.o
439
[ 59%] Building CXX object op25/gr-op25_repeater/lib/imbe_vocoder/CMakeFiles/imbe_vocoder.dir/v_synt.cc.o
440
[ 60%] Building CXX object op25/gr-op25_repeater/lib/imbe_vocoder/CMakeFiles/imbe_vocoder.dir/v_uv_det.cc.o
441
[ 61%] Linking CXX static library libimbe_vocoder.a
442
[ 61%] Built target imbe_vocoder
443
Scanning dependencies of target gnuradio-op25_repeater
444
[ 62%] Building CXX object op25/gr-op25_repeater/lib/CMakeFiles/gnuradio-op25_repeater.dir/ambe_encoder_sb_impl.cc.o
445
[ 63%] Building CXX object op25/gr-op25_repeater/lib/CMakeFiles/gnuradio-op25_repeater.dir/dmr_bs_tx_bb_impl.cc.o
446
[ 63%] Building CXX object op25/gr-op25_repeater/lib/CMakeFiles/gnuradio-op25_repeater.dir/ysf_tx_sb_impl.cc.o
447
[ 64%] Building CXX object op25/gr-op25_repeater/lib/CMakeFiles/gnuradio-op25_repeater.dir/dstar_tx_sb_impl.cc.o
448
[ 65%] Building CXX object op25/gr-op25_repeater/lib/CMakeFiles/gnuradio-op25_repeater.dir/vocoder_impl.cc.o
449
[ 66%] Building CXX object op25/gr-op25_repeater/lib/CMakeFiles/gnuradio-op25_repeater.dir/gardner_costas_cc_impl.cc.o
450
[ 67%] Building CXX object op25/gr-op25_repeater/lib/CMakeFiles/gnuradio-op25_repeater.dir/p25_frame_assembler_impl.cc.o
451
/home/user/sdr/src/op25/op25/gr-op25_repeater/lib/p25_frame_assembler_impl.cc: In member function ‘void gr::op25_repeater::p25_frame_assembler_impl::p25p2_queue_msg(int)’:
452
/home/user/sdr/src/op25/op25/gr-op25_repeater/lib/p25_frame_assembler_impl.cc:42:41: error: narrowing conversion of ‘255’ from ‘int’ to ‘char’ inside { } [-Wnarrowing]
453
  static const char wbuf[2] = {0xff, 0xff}; // dummy NAC
454
                                         ^
455
/home/user/sdr/src/op25/op25/gr-op25_repeater/lib/p25_frame_assembler_impl.cc:42:41: error: narrowing conversion of ‘255’ from ‘int’ to ‘char’ inside { } [-Wnarrowing]
456
op25/gr-op25_repeater/lib/CMakeFiles/gnuradio-op25_repeater.dir/build.make:206: recipe for target 'op25/gr-op25_repeater/lib/CMakeFiles/gnuradio-op25_repeater.dir/p25_frame_assembler_impl.cc.o' failed
457
make[2]: *** [op25/gr-op25_repeater/lib/CMakeFiles/gnuradio-op25_repeater.dir/p25_frame_assembler_impl.cc.o] Error 1
458
CMakeFiles/Makefile2:682: recipe for target 'op25/gr-op25_repeater/lib/CMakeFiles/gnuradio-op25_repeater.dir/all' failed
459
make[1]: *** [op25/gr-op25_repeater/lib/CMakeFiles/gnuradio-op25_repeater.dir/all] Error 2
460
Makefile:129: recipe for target 'all' failed
461
make: *** [all] Error 2
462
[ 24%] Built target gnuradio-op25
463
[ 27%] Built target test-op25
464
[ 28%] Built target _op25_swig_swig_tag
465
[ 30%] Built target _op25_swig_doc_tag
466
[ 35%] Built target _op25_swig
467
[ 40%] Built target pygen_op25_gr_op25_swig_816d0
468
[ 42%] Built target pygen_op25_gr_op25_python_9989f
469
[ 42%] Built target pygen_op25_gr_op25_apps_383eb
470
[ 61%] Built target imbe_vocoder
471
[ 62%] Building CXX object op25/gr-op25_repeater/lib/CMakeFiles/gnuradio-op25_repeater.dir/p25_frame_assembler_impl.cc.o
472
/home/user/sdr/src/op25/op25/gr-op25_repeater/lib/p25_frame_assembler_impl.cc: In member function ‘void gr::op25_repeater::p25_frame_assembler_impl::p25p2_queue_msg(int)’:
473
/home/user/sdr/src/op25/op25/gr-op25_repeater/lib/p25_frame_assembler_impl.cc:42:41: error: narrowing conversion of ‘255’ from ‘int’ to ‘char’ inside { } [-Wnarrowing]
474
  static const char wbuf[2] = {0xff, 0xff}; // dummy NAC
475
                                         ^
476
/home/user/sdr/src/op25/op25/gr-op25_repeater/lib/p25_frame_assembler_impl.cc:42:41: error: narrowing conversion of ‘255’ from ‘int’ to ‘char’ inside { } [-Wnarrowing]
477
op25/gr-op25_repeater/lib/CMakeFiles/gnuradio-op25_repeater.dir/build.make:206: recipe for target 'op25/gr-op25_repeater/lib/CMakeFiles/gnuradio-op25_repeater.dir/p25_frame_assembler_impl.cc.o' failed
478
make[2]: *** [op25/gr-op25_repeater/lib/CMakeFiles/gnuradio-op25_repeater.dir/p25_frame_assembler_impl.cc.o] Error 1
479
CMakeFiles/Makefile2:682: recipe for target 'op25/gr-op25_repeater/lib/CMakeFiles/gnuradio-op25_repeater.dir/all' failed
480
make[1]: *** [op25/gr-op25_repeater/lib/CMakeFiles/gnuradio-op25_repeater.dir/all] Error 2
481
Makefile:129: recipe for target 'all' failed
482
make: *** [all] Error 2
483
======
484
====== NOTICE
485
======
486
====== The gnuplot package is not installed by default here,
487
====== as its installation requires numerous prerequisite packages
488
====== that you may not want to install.
489
======
490
====== In order to do plotting in rx.py using the -P option
491
====== you must install gnuplot, e.g., manually as follows:
492
======
493
====== sudo apt-get install gnuplot-x11
494
======
495

    
Add picture from clipboard (Maximum size: 48.8 MB)