Project

General

Profile

osmo-msc-openSUSE-Tumbleweed-gcc9-LTO-enabled-buildlog.txt

buildlog - roox, 07/17/2019 09:59 PM

 
1
[    0s] Memory limit set to 32903272KB
2
[    0s] Using BUILD_ROOT=/var/tmp/build-root/openSUSE_Tumbleweed-x86_64
3
[    0s] Using BUILD_ARCH=x86_64:i686:i586:i486:i386
4
[    0s] 
5
[    0s] 
6
[    0s] build started "build osmo-msc.spec" at Wed Jul 17 21:58:15 UTC 2019.
7
[    0s] 
8
[    0s] 
9
[    0s] processing recipe /home/mhauke/Projects/home:mnhauke:osmocom:nightly/osmo-msc/osmo-msc.spec ...
10
[    1s] running changelog2spec --target rpm --file /home/mhauke/Projects/home:mnhauke:osmocom:nightly/osmo-msc/osmo-msc.spec
11
[    1s] init_buildsystem --configdir /usr/lib/build/configs --cachedir /var/cache/build --rpmlist /tmp/rpmlist.4ajv2_it /home/mhauke/Projects/home:mnhauke:osmocom:nightly/osmo-msc/osmo-msc.spec ...
12
[    1s] reordering...cycle: libncurses6 -> terminfo-base
13
[    1s]   breaking dependency terminfo-base -> libncurses6
14
[    1s] cycle: libcrack2 -> cracklib
15
[    1s]   breaking dependency cracklib -> libcrack2
16
[    1s] cycle: shadow -> pam
17
[    1s]   breaking dependency pam -> shadow
18
[    1s] cycle: libdw1 -> libelf1 -> libebl-plugins
19
[    1s]   breaking dependency libebl-plugins -> libdw1
20
[    1s] cycle: libelf1 -> libebl-plugins
21
[    1s]   breaking dependency libelf1 -> libebl-plugins
22
[    1s] cycle: rpm -> rpm-config-SUSE
23
[    1s]   breaking dependency rpm -> rpm-config-SUSE
24
[    1s] cycle: libopenssl-1_1-devel -> libopenssl-devel
25
[    1s]   breaking dependency libopenssl-devel -> libopenssl-1_1-devel
26
[    1s] done
27
[    1s] querying package ids...
28
[    2s] deleting libgtp-devel
29
[    2s] deleting libgtp4
30
[    2s] deleting libgtp4-debuginfo
31
[    2s] deleting libgtpnl-devel
32
[    2s] deleting libgtpnl0
33
[    2s] deleting libmnl-devel
34
[    2s] deleting osmo-ggsn
35
[    2s] deleting osmo-ggsn-debuginfo
36
[    2s] deleting osmo-ggsn-debugsource
37
[    2s] [1/173] keeping file-magic-5.37-2.1
38
[    2s] [2/173] keeping kernel-obs-build-5.1.16-1.3
39
[    2s] [3/173] keeping libtirpc-netconfig-1.0.3-3.5
40
[    2s] [4/173] keeping python-rpm-macros-20190610.2ee3233-1.2
41
[    2s] [5/173] keeping system-user-root-20190513-1.5
42
[    2s] [6/173] keeping vim-data-common-8.1.1600-1.2
43
[    2s] [7/173] keeping filesystem-15.5-27.1
44
[    2s] [8/173] keeping glibc-2.29-7.2
45
[    2s] [9/173] keeping fillup-1.42-274.6
46
[    2s] [10/173] keeping hostname-3.21-1.5
47
[    2s] [11/173] keeping libacl1-2.2.53-3.5
48
[    2s] [12/173] keeping libatomic1-9.1.1+r272147-1.2
49
[    2s] [13/173] keeping libattr1-2.4.48-2.9
50
[    2s] [14/173] keeping libaudit1-2.8.4-2.2
51
[    2s] [15/173] keeping libbz2-1-1.0.7-1.2
52
[    2s] [16/173] keeping libcap-ng0-0.7.9-1.13
53
[    2s] [17/173] keeping libcap2-2.25-4.13
54
[    2s] [18/173] keeping libcom_err2-1.45.2-2.2
55
[    2s] [19/173] keeping libcrypt1-4.4.3-2.2
56
[    2s] [20/173] cumulate libdbi3-0.9.0.g33-2.16
57
[    2s] [21/173] keeping libexpat1-2.2.7-1.2
58
[    2s] [22/173] keeping libffi7-3.2.1.git259-6.7
59
[    2s] [23/173] keeping libgcc_s1-9.1.1+r272147-1.2
60
[    2s] [24/173] keeping libgdbm6-1.18.1-1.5
61
[    2s] [25/173] keeping libgmp10-6.1.2-4.2
62
[    2s] [26/173] keeping libgomp1-9.1.1+r272147-1.2
63
[    2s] [27/173] keeping libitm1-9.1.1+r272147-1.2
64
[    2s] [28/173] keeping libkeyutils1-1.6-1.2
65
[    2s] [29/173] keeping libltdl7-2.4.6-7.9
66
[    2s] [30/173] keeping liblua5_3-5-5.3.5-1.5
67
[    2s] [31/173] keeping liblzma5-5.2.4-2.4
68
[    2s] [32/173] keeping libmnl0-1.0.4-1.10
69
[    2s] [33/173] keeping libopenssl1_1-1.1.1c-1.2
70
[    2s] [34/173] keeping libpcre1-8.42-2.9
71
[    2s] [35/173] keeping libpopt0-1.16-31.5
72
[    2s] [36/173] keeping libpython3_7m1_0-3.7.3-1.3
73
[    2s] [37/173] keeping libsepol1-2.9-2.2
74
[    2s] [38/173] keeping libsmartcols1-2.33.2-2.2
75
[    2s] [39/173] cumulate libsmpp34-1-1.13.0.6-5.1
76
[    2s] [40/173] keeping libtalloc2-2.1.16-1.4
77
[    2s] [41/173] keeping libuuid1-2.33.2-2.2
78
[    2s] [42/173] keeping libverto1-0.2.6-7.14
79
[    2s] [43/173] keeping libz1-1.2.11-8.2
80
[    2s] [44/173] keeping libzstd1-1.4.0-4.1
81
[    2s] [45/173] keeping patch-2.7.6-3.13
82
[    2s] [46/173] keeping pkg-config-0.29.2-3.5
83
[    2s] [47/173] keeping update-alternatives-1.19.0.5-4.5
84
[    2s] [48/173] keeping attr-2.4.48-2.9
85
[    2s] [49/173] keeping chkstat-1550_20190521-3.2
86
[    2s] [50/173] cumulate libasn1c0-0.9.31.4-7.1
87
[    2s] [51/173] keeping libblkid1-2.33.2-2.2
88
[    2s] [52/173] cumulate libdbi-devel-0.9.0.g33-2.16
89
[    2s] [53/173] keeping libgdbm_compat4-1.18.1-1.5
90
[    2s] [54/173] keeping libisl19-0.20-1.9
91
[    2s] [55/173] keeping libmpfr6-4.0.2-1.5
92
[    2s] [56/173] keeping libosmocore12-1.1.0.80-1.1
93
[    2s] [57/173] keeping libselinux1-2.9-5.2
94
[    2s] [58/173] cumulate libsmpp34-1-devel-1.13.0.6-5.1
95
[    2s] [59/173] keeping libstdc++6-9.1.1+r272147-1.2
96
[    2s] [60/173] keeping libtalloc-devel-2.1.16-1.4
97
[    2s] [61/173] keeping libxcrypt-devel-4.4.3-2.2
98
[    2s] [62/173] keeping perl-base-5.28.1-3.2
99
[    2s] [63/173] keeping libmagic1-5.37-2.1
100
[    2s] [64/173] keeping libzio1-1.06-3.19
101
[    2s] [65/173] keeping build-mkbaselibs-20190627-1.1
102
[    2s] [66/173] keeping file-5.37-2.1
103
[    2s] [67/173] keeping libasan5-9.1.1+r272147-1.2
104
[    2s] [68/173] cumulate libasn1c-devel-0.9.31.4-7.1
105
[    2s] [69/173] keeping libdb-4_8-4.8.30-37.9
106
[    2s] [70/173] keeping libfdisk1-2.33.2-2.2
107
[    2s] [71/173] keeping liblsan0-9.1.1+r272147-1.2
108
[    2s] [72/173] keeping libmount1-2.33.2-2.2
109
[    2s] [73/173] keeping libmpc3-1.1.0-1.13
110
[    2s] [74/173] cumulate libosmo-sccp-1_0_0_25-1.0.0.25-1.1
111
[    2s] [75/173] keeping libosmocore-devel-1.1.0.80-1.1
112
[    2s] [76/173] keeping libosmogsm12-1.1.0.80-1.1
113
[    2s] [77/173] keeping libosmovty4-1.1.0.80-1.1
114
[    2s] [78/173] keeping libtsan0-9.1.1+r272147-1.2
115
[    2s] [79/173] keeping libubsan1-9.1.1+r272147-1.2
116
[    2s] [80/173] keeping libsemanage1-2.9-3.2
117
[    2s] [81/173] cumulate libosmo-sccp-devel-1.0.0.25-1.1
118
[    2s] [82/173] keeping libosmogsm-devel-1.1.0.80-1.1
119
[    2s] [83/173] keeping libosmovty-devel-1.1.0.80-1.1
120
[    2s] [84/173] cumulate libosmo-mgcp-client5-1.5.0.77-7.1
121
[    2s] [85/173] cumulate libosmoabis6-0.6.0.12-1.1
122
[    2s] [86/173] keeping libosmoctrl0-1.1.0.80-1.1
123
[    2s] [87/173] keeping cpp9-9.1.1+r272147-1.2
124
[    2s] [88/173] keeping perl-5.28.1-3.2
125
[    2s] [89/173] keeping brp-check-suse-84.87+git20190423.d0bda31-1.1
126
[    2s] [90/173] cumulate libosmo-mgcp-client-devel-1.5.0.77-7.1
127
[    2s] [91/173] cumulate libosmo-gsup-client0-1.0.0.41-2.1
128
[    2s] [92/173] cumulate libosmoabis-devel-0.6.0.12-1.1
129
[    2s] [93/173] keeping libosmoctrl-devel-1.1.0.80-1.1
130
[    2s] [94/173] cumulate libosmo-gsup-client-devel-1.0.0.41-2.1
131
[    2s] [95/173] keeping terminfo-base-6.1-17.1
132
[    2s] [96/173] keeping libelf1-0.176-4.2
133
[    2s] [97/173] keeping dwz-0.12-6.5
134
[    2s] [98/173] keeping libebl-plugins-0.176-4.2
135
[    2s] [99/173] keeping libncurses6-6.1-17.1
136
[    2s] [100/173] keeping libdw1-0.176-4.2
137
[    2s] [101/173] keeping libreadline8-8.0-1.6
138
[    2s] [102/173] keeping ncurses-utils-6.1-17.1
139
[    2s] [103/173] keeping bash-5.0-7.4
140
[    2s] [104/173] keeping cpp-9-1.5
141
[    2s] [105/173] cumulate lksctp-tools-1.0.16-2.3
142
[    2s] [106/173] keeping bzip2-1.0.7-1.2
143
[    2s] [107/173] keeping cracklib-2.9.6-2.13
144
[    2s] [108/173] keeping gettext-runtime-mini-0.19.8.1-13.2
145
[    2s] [109/173] keeping xz-5.2.4-2.4
146
[    2s] [110/173] keeping info-6.5-6.10
147
[    2s] [111/173] keeping less-530-1.7
148
[    2s] [112/173] keeping strace-5.1-1.2
149
[    2s] [113/173] keeping iproute2-5.1-1.4
150
[    2s] [114/173] keeping vim-8.1.1600-1.2
151
[    2s] [115/173] keeping python3-base-3.7.3-1.3
152
[    2s] [116/173] keeping cpio-2.12-6.9
153
[    2s] [117/173] keeping diffutils-3.7-1.5
154
[    2s] [118/173] keeping gzip-1.10-2.1
155
[    2s] [119/173] keeping libcrack2-2.9.6-2.13
156
[    2s] [120/173] keeping m4-1.4.18-4.9
157
[    2s] [121/173] keeping make-4.2.1-7.9
158
[    2s] [122/173] keeping which-2.21-4.13
159
[    2s] [123/173] keeping findutils-4.6.0-5.2
160
[    2s] [124/173] keeping gawk-4.2.1-1.17
161
[    2s] [125/173] keeping gettext-tools-mini-0.19.8.1-13.2
162
[    2s] [126/173] keeping grep-3.3-2.4
163
[    2s] [127/173] keeping tar-1.32-1.2
164
[    2s] [128/173] keeping binutils-2.32-5.5
165
[    2s] [129/173] cumulate libosmonetif6-0.5.0.2-7.1
166
[    2s] [130/173] keeping sed-4.7-1.4
167
[    2s] [131/173] keeping coreutils-8.31-1.6
168
[    2s] [132/173] keeping gdb-8.3-2.2
169
[    2s] [133/173] keeping systemd-rpm-macros-4-2.5
170
[    2s] [134/173] cumulate libosmonetif-devel-0.5.0.2-7.1
171
[    2s] [135/173] keeping linux-glibc-devel-5.1-1.2
172
[    2s] [136/173] keeping glibc-locale-base-2.29-7.2
173
[    2s] [137/173] cumulate openssl-1_1-1.1.1c-1.2
174
[    2s] [138/173] keeping autoconf-2.69-16.9
175
[    2s] [139/173] cumulate libosmo-sigtran3-1.0.0.25-1.1
176
[    2s] [140/173] keeping permissions-config-1550_20190521-3.2
177
[    2s] [141/173] keeping krb5-mini-1.17-2.5
178
[    2s] [142/173] keeping rpm-4.14.2.1-6.1
179
[    2s] [143/173] keeping glibc-locale-2.29-7.2
180
[    2s] [144/173] cumulate openssl-1.1.1c-1.1
181
[    2s] [145/173] cumulate libosmo-sigtran-devel-1.0.0.25-1.1
182
[    2s] [146/173] keeping permissions-20190521-3.2
183
[    2s] [147/173] keeping rpm-config-SUSE-0.g27-1.1
184
[    2s] [148/173] keeping libtirpc3-1.0.3-3.5
185
[    2s] [149/173] keeping automake-1.16.1-4.5
186
[    2s] [150/173] keeping glibc-devel-2.29-7.2
187
[    2s] [151/173] cumulate libosmo-ranap2-0.4.0.10-2.1
188
[    2s] [152/173] keeping rpmlint-mini-1.10-8.29
189
[    2s] [153/173] keeping build-compare-20190219T103140.3277313-1.4
190
[    2s] [154/173] keeping rpmlint-Factory-1.0-94.2
191
[    2s] [155/173] keeping libnsl2-1.2.0-2.13
192
[    2s] [156/173] cumulate libosmo-ranap-devel-0.4.0.10-2.1
193
[    2s] [157/173] cumulate lksctp-tools-devel-1.0.16-2.3
194
[    2s] [158/173] cumulate libopenssl-devel-1.1.1c-1.1
195
[    2s] [159/173] keeping libtool-2.4.6-7.9
196
[    2s] [160/173] keeping gcc9-9.1.1+r272147-1.2
197
[    2s] [161/173] keeping gcc-9-1.5
198
[    2s] [162/173] cumulate libopenssl-1_1-devel-1.1.1c-1.2
199
[    2s] [163/173] keeping pam-1.3.1-3.5
200
[    2s] [164/173] keeping gcc-PIE-9-1.5
201
[    2s] [165/173] keeping shadow-4.7-1.1
202
[    2s] [166/173] keeping sysuser-shadow-2.0-3.5
203
[    2s] [167/173] keeping system-group-hardware-20170617-7.5
204
[    2s] [168/173] keeping libutempter0-1.1.6-10.13
205
[    2s] [169/173] keeping util-linux-2.33.2-2.2
206
[    2s] [170/173] keeping aaa_base-84.87+git20190418.d83e9d6-2.1
207
[    2s] [171/173] keeping rpm-build-4.14.2.1-6.1
208
[    2s] [172/173] keeping aaa_base-malloccheck-84.87+git20190418.d83e9d6-2.1
209
[    2s] [173/173] keeping post-build-checks-84.88+git20190702.429d0e0-1.1
210
[    2s] now installing cumulated packages
211
[    3s] Preparing...                          ########################################
212
[    3s] Updating / installing...
213
[    3s] lksctp-tools-1.0.16-2.3               ########################################
214
[    3s] libosmonetif6-0.5.0.2-7.1             ########################################
215
[    3s] libosmo-sigtran3-1.0.0.25-1.1         ########################################
216
[    3s] openssl-1_1-1.1.1c-1.2                ########################################
217
[    3s] libosmoabis6-0.6.0.12-1.1             ########################################
218
[    3s] libasn1c0-0.9.31.4-7.1                ########################################
219
[    3s] libosmo-ranap2-0.4.0.10-2.1           ########################################
220
[    3s] libosmo-gsup-client0-1.0.0.41-2.1     ########################################
221
[    3s] openssl-1.1.1c-1.1                    ########################################
222
[    3s] libopenssl-1_1-devel-1.1.1c-1.2       ########################################
223
[    3s] libosmo-mgcp-client5-1.5.0.77-7.1     ########################################
224
[    3s] libosmo-sccp-1_0_0_25-1.0.0.25-1.1    ########################################
225
[    3s] libsmpp34-1-1.13.0.6-5.1              ########################################
226
[    3s] libdbi3-0.9.0.g33-2.16                ########################################
227
[    3s] libdbi-devel-0.9.0.g33-2.16           ########################################
228
[    3s] libsmpp34-1-devel-1.13.0.6-5.1        ########################################
229
[    3s] libosmo-sccp-devel-1.0.0.25-1.1       ########################################
230
[    3s] libosmo-mgcp-client-devel-1.5.0.77-7.1########################################
231
[    3s] libopenssl-devel-1.1.1c-1.1           ########################################
232
[    3s] libosmo-gsup-client-devel-1.0.0.41-2.1########################################
233
[    3s] libosmo-ranap-devel-0.4.0.10-2.1      ########################################
234
[    3s] libasn1c-devel-0.9.31.4-7.1           ########################################
235
[    3s] libosmoabis-devel-0.6.0.12-1.1        ########################################
236
[    3s] libosmo-sigtran-devel-1.0.0.25-1.1    ########################################
237
[    3s] libosmonetif-devel-0.5.0.2-7.1        ########################################
238
[    3s] lksctp-tools-devel-1.0.16-2.3         ########################################
239
[    3s] removing nis flags from /var/tmp/build-root/openSUSE_Tumbleweed-x86_64/etc/nsswitch.conf...
240
[    3s] now finalizing build dir...
241
[    3s] cp: -r not specified; omitting directory '/home/mhauke/Projects/home:mnhauke:osmocom:nightly/osmo-msc/osmo-msc'
242
[    3s] Running build time source services...
243
[    4s] -----------------------------------------------------------------
244
[    4s] I have the following modifications for osmo-msc.spec:
245
[    4s] -----------------------------------------------------------------
246
[    4s] ----- building osmo-msc.spec (user abuild)
247
[    4s] -----------------------------------------------------------------
248
[    4s] -----------------------------------------------------------------
249
[    4s] + exec rpmbuild -ba --define '_srcdefattr (-,root,root)' --nosignature --define '_build_create_debug 1' /home/abuild/rpmbuild/SOURCES/osmo-msc.spec
250
[    4s] setting SOURCE_DATE_EPOCH=1563364800
251
[    4s] Executing(%prep): /bin/sh -e /var/tmp/rpm-tmp.3eFyZK
252
[    4s] + umask 022
253
[    4s] + cd /home/abuild/rpmbuild/BUILD
254
[    4s] + cd /home/abuild/rpmbuild/BUILD
255
[    4s] + rm -rf osmo-msc-1.3.1.179
256
[    4s] + /usr/bin/xz -dc /home/abuild/rpmbuild/SOURCES/osmo-msc-1.3.1.179.tar.xz
257
[    4s] + /usr/bin/tar -xof -
258
[    4s] + STATUS=0
259
[    4s] + '[' 0 -ne 0 ']'
260
[    4s] + cd osmo-msc-1.3.1.179
261
[    4s] + /usr/bin/chmod -Rf a+rX,u+w,g-w,o-w .
262
[    4s] + exit 0
263
[    4s] Executing(%build): /bin/sh -e /var/tmp/rpm-tmp.co5mLl
264
[    4s] + umask 022
265
[    4s] + cd /home/abuild/rpmbuild/BUILD
266
[    4s] + /usr/bin/rm -rf /home/abuild/rpmbuild/BUILDROOT/osmo-msc-1.3.1.179-0.x86_64
267
[    4s] ++ dirname /home/abuild/rpmbuild/BUILDROOT/osmo-msc-1.3.1.179-0.x86_64
268
[    4s] + /usr/bin/mkdir -p /home/abuild/rpmbuild/BUILDROOT
269
[    4s] + /usr/bin/mkdir /home/abuild/rpmbuild/BUILDROOT/osmo-msc-1.3.1.179-0.x86_64
270
[    4s] + cd osmo-msc-1.3.1.179
271
[    4s] + echo 1.3.1.179
272
[    4s] + autoreconf -fi
273
[    8s] libtoolize: putting auxiliary files in AC_CONFIG_AUX_DIR, '.'.
274
[    8s] libtoolize: copying file './ltmain.sh'
275
[    8s] libtoolize: putting macros in 'm4'.
276
[    8s] libtoolize: copying file 'm4/libtool.m4'
277
[    8s] libtoolize: copying file 'm4/ltoptions.m4'
278
[    8s] libtoolize: copying file 'm4/ltsugar.m4'
279
[    8s] libtoolize: copying file 'm4/ltversion.m4'
280
[    8s] libtoolize: copying file 'm4/lt~obsolete.m4'
281
[    8s] libtoolize: Consider adding 'AC_CONFIG_MACRO_DIRS([m4])' to configure.ac,
282
[    8s] libtoolize: and rerunning libtoolize and aclocal.
283
[   11s] configure.ac:21: installing './compile'
284
[   11s] configure.ac:23: installing './config.guess'
285
[   11s] configure.ac:23: installing './config.sub'
286
[   11s] configure.ac:9: installing './install-sh'
287
[   11s] configure.ac:9: installing './missing'
288
[   11s] doc/sequence_charts/Makefile.am:27: warning: '%'-style pattern rules are a GNU make extension
289
[   11s] doc/sequence_charts/Makefile.am:30: warning: '%'-style pattern rules are a GNU make extension
290
[   11s] src/libmsc/Makefile.am: installing './depcomp'
291
[   11s] tests/db_sms/Makefile.am:31: warning: source file '$(srcdir)/../stubs.c' is in a subdirectory,
292
[   11s] tests/db_sms/Makefile.am:31: but option 'subdir-objects' is disabled
293
[   11s] automake: warning: possible forward-incompatibility.
294
[   11s] automake: At least a source file is in a subdirectory, but the 'subdir-objects'
295
[   11s] automake: automake option hasn't been enabled.  For now, the corresponding output
296
[   11s] automake: object file(s) will be placed in the top-level directory.  However,
297
[   11s] automake: this behaviour will change in future Automake versions: they will
298
[   11s] automake: unconditionally cause object files to be placed in the same subdirectory
299
[   11s] automake: of the corresponding sources.
300
[   11s] automake: You are advised to start using 'subdir-objects' option throughout your
301
[   11s] automake: project, to avoid future incompatibilities.
302
[   11s] tests/msc_vlr/Makefile.am:118: warning: source file '$(srcdir)/../stubs.c' is in a subdirectory,
303
[   11s] tests/msc_vlr/Makefile.am:118: but option 'subdir-objects' is disabled
304
[   11s] tests/msc_vlr/Makefile.am:148: warning: source file '$(srcdir)/../stubs.c' is in a subdirectory,
305
[   11s] tests/msc_vlr/Makefile.am:148: but option 'subdir-objects' is disabled
306
[   11s] tests/msc_vlr/Makefile.am:100: warning: source file '$(srcdir)/../stubs.c' is in a subdirectory,
307
[   11s] tests/msc_vlr/Makefile.am:100: but option 'subdir-objects' is disabled
308
[   11s] tests/msc_vlr/Makefile.am:106: warning: source file '$(srcdir)/../stubs.c' is in a subdirectory,
309
[   11s] tests/msc_vlr/Makefile.am:106: but option 'subdir-objects' is disabled
310
[   11s] tests/msc_vlr/Makefile.am:124: warning: source file '$(srcdir)/../stubs.c' is in a subdirectory,
311
[   11s] tests/msc_vlr/Makefile.am:124: but option 'subdir-objects' is disabled
312
[   11s] tests/msc_vlr/Makefile.am:130: warning: source file '$(srcdir)/../stubs.c' is in a subdirectory,
313
[   11s] tests/msc_vlr/Makefile.am:130: but option 'subdir-objects' is disabled
314
[   11s] tests/msc_vlr/Makefile.am:136: warning: source file '$(srcdir)/../stubs.c' is in a subdirectory,
315
[   11s] tests/msc_vlr/Makefile.am:136: but option 'subdir-objects' is disabled
316
[   11s] tests/msc_vlr/Makefile.am:94: warning: source file '$(srcdir)/../stubs.c' is in a subdirectory,
317
[   11s] tests/msc_vlr/Makefile.am:94: but option 'subdir-objects' is disabled
318
[   11s] tests/msc_vlr/Makefile.am:142: warning: source file '$(srcdir)/../stubs.c' is in a subdirectory,
319
[   11s] tests/msc_vlr/Makefile.am:142: but option 'subdir-objects' is disabled
320
[   11s] tests/msc_vlr/Makefile.am:154: warning: source file '$(srcdir)/../stubs.c' is in a subdirectory,
321
[   11s] tests/msc_vlr/Makefile.am:154: but option 'subdir-objects' is disabled
322
[   11s] tests/msc_vlr/Makefile.am:160: warning: source file '$(srcdir)/../stubs.c' is in a subdirectory,
323
[   11s] tests/msc_vlr/Makefile.am:160: but option 'subdir-objects' is disabled
324
[   11s] tests/msc_vlr/Makefile.am:112: warning: source file '$(srcdir)/../stubs.c' is in a subdirectory,
325
[   11s] tests/msc_vlr/Makefile.am:112: but option 'subdir-objects' is disabled
326
[   11s] tests/smpp/Makefile.am:31: warning: source file '$(top_builddir)/src/libmsc/smpp_utils.c' is in a subdirectory,
327
[   11s] tests/smpp/Makefile.am:31: but option 'subdir-objects' is disabled
328
[   12s] + CFLAGS='-O2 -Wall -D_FORTIFY_SOURCE=2 -fstack-protector-strong -funwind-tables -fasynchronous-unwind-tables -fstack-clash-protection -flto=4 -g'
329
[   12s] + export CFLAGS
330
[   12s] + CXXFLAGS='-O2 -Wall -D_FORTIFY_SOURCE=2 -fstack-protector-strong -funwind-tables -fasynchronous-unwind-tables -fstack-clash-protection -flto=4 -g'
331
[   12s] + export CXXFLAGS
332
[   12s] + FFLAGS='-O2 -Wall -D_FORTIFY_SOURCE=2 -fstack-protector-strong -funwind-tables -fasynchronous-unwind-tables -fstack-clash-protection -flto=4 -g'
333
[   12s] + export FFLAGS
334
[   12s] + ./configure --host=x86_64-suse-linux-gnu --build=x86_64-suse-linux-gnu --program-prefix= --disable-dependency-tracking --prefix=/usr --exec-prefix=/usr --bindir=/usr/bin --sbindir=/usr/sbin --sysconfdir=/etc --datadir=/usr/share --includedir=/usr/include --libdir=/usr/lib64 --libexecdir=/usr/lib --localstatedir=/var --sharedstatedir=/var/lib --mandir=/usr/share/man --infodir=/usr/share/info --disable-dependency-tracking --enable-iu --docdir=/usr/share/doc/packages/osmo-msc --with-systemdsystemunitdir=/usr/lib/systemd/system
335
[   12s] checking for a BSD-compatible install... /usr/bin/install -c
336
[   12s] checking whether build environment is sane... yes
337
[   12s] checking for a thread-safe mkdir -p... /usr/bin/mkdir -p
338
[   12s] checking for gawk... gawk
339
[   12s] checking whether make sets $(MAKE)... yes
340
[   12s] checking whether make supports nested variables... yes
341
[   12s] checking whether make supports nested variables... (cached) yes
342
[   12s] checking whether make sets $(MAKE)... (cached) yes
343
[   12s] checking for x86_64-suse-linux-gnu-gcc... no
344
[   12s] checking for gcc... gcc
345
[   12s] checking whether the C compiler works... yes
346
[   12s] checking for C compiler default output file name... a.out
347
[   12s] checking for suffix of executables... 
348
[   12s] checking whether we are cross compiling... no
349
[   12s] checking for suffix of object files... o
350
[   12s] checking whether we are using the GNU C compiler... yes
351
[   12s] checking whether gcc accepts -g... yes
352
[   12s] checking for gcc option to accept ISO C89... none needed
353
[   12s] checking whether gcc understands -c and -o together... yes
354
[   12s] checking whether make supports the include directive... yes (GNU style)
355
[   12s] checking dependency style of gcc... none
356
[   12s] checking build system type... x86_64-suse-linux-gnu
357
[   13s] checking host system type... x86_64-suse-linux-gnu
358
[   13s] checking how to print strings... printf
359
[   13s] checking for a sed that does not truncate output... /usr/bin/sed
360
[   13s] checking for grep that handles long lines and -e... /usr/bin/grep
361
[   13s] checking for egrep... /usr/bin/grep -E
362
[   13s] checking for fgrep... /usr/bin/grep -F
363
[   13s] checking for ld used by gcc... /usr/x86_64-suse-linux/bin/ld
364
[   13s] checking if the linker (/usr/x86_64-suse-linux/bin/ld) is GNU ld... yes
365
[   13s] checking for BSD- or MS-compatible name lister (nm)... /usr/bin/nm -B
366
[   13s] checking the name lister (/usr/bin/nm -B) interface... BSD nm
367
[   13s] checking whether ln -s works... yes
368
[   13s] checking the maximum length of command line arguments... 1572864
369
[   13s] checking how to convert x86_64-suse-linux-gnu file names to x86_64-suse-linux-gnu format... func_convert_file_noop
370
[   13s] checking how to convert x86_64-suse-linux-gnu file names to toolchain format... func_convert_file_noop
371
[   13s] checking for /usr/x86_64-suse-linux/bin/ld option to reload object files... -r
372
[   13s] checking for x86_64-suse-linux-gnu-objdump... no
373
[   13s] checking for objdump... objdump
374
[   13s] checking how to recognize dependent libraries... pass_all
375
[   13s] checking for x86_64-suse-linux-gnu-dlltool... no
376
[   13s] checking for dlltool... no
377
[   13s] checking how to associate runtime and link libraries... printf %s\n
378
[   13s] checking for x86_64-suse-linux-gnu-ar... no
379
[   13s] checking for ar... ar
380
[   13s] checking for archiver @FILE support... @
381
[   13s] checking for x86_64-suse-linux-gnu-strip... no
382
[   13s] checking for strip... strip
383
[   13s] checking for x86_64-suse-linux-gnu-ranlib... no
384
[   13s] checking for ranlib... ranlib
385
[   13s] checking command to parse /usr/bin/nm -B output from gcc object... ok
386
[   13s] checking for sysroot... no
387
[   13s] checking for a working dd... /usr/bin/dd
388
[   13s] checking how to truncate binary pipes... /usr/bin/dd bs=4096 count=1
389
[   13s] checking for x86_64-suse-linux-gnu-mt... no
390
[   13s] checking for mt... no
391
[   13s] checking if : is a manifest tool... no
392
[   13s] checking how to run the C preprocessor... gcc -E
393
[   13s] checking for ANSI C header files... yes
394
[   13s] checking for sys/types.h... yes
395
[   13s] checking for sys/stat.h... yes
396
[   13s] checking for stdlib.h... yes
397
[   13s] checking for string.h... yes
398
[   13s] checking for memory.h... yes
399
[   13s] checking for strings.h... yes
400
[   14s] checking for inttypes.h... yes
401
[   14s] checking for stdint.h... yes
402
[   14s] checking for unistd.h... yes
403
[   14s] checking for dlfcn.h... yes
404
[   14s] checking for objdir... .libs
405
[   14s] checking if gcc supports -fno-rtti -fno-exceptions... no
406
[   14s] checking for gcc option to produce PIC... -fPIC -DPIC
407
[   14s] checking if gcc PIC flag -fPIC -DPIC works... yes
408
[   14s] checking if gcc static flag -static works... no
409
[   14s] checking if gcc supports -c -o file.o... yes
410
[   14s] checking if gcc supports -c -o file.o... (cached) yes
411
[   14s] checking whether the gcc linker (/usr/x86_64-suse-linux/bin/ld -m elf_x86_64) supports shared libraries... yes
412
[   14s] checking whether -lc should be explicitly linked in... no
413
[   14s] checking dynamic linker characteristics... GNU/Linux ld.so
414
[   14s] checking how to hardcode library paths into programs... immediate
415
[   14s] checking whether stripping libraries is possible... yes
416
[   14s] checking if libtool supports shared libraries... yes
417
[   14s] checking whether to build shared libraries... yes
418
[   14s] checking whether to build static libraries... yes
419
[   14s] checking for pkg-config... /usr/bin/pkg-config
420
[   14s] checking for x86_64-suse-linux-gnu-pkg-config... /usr/bin/x86_64-suse-linux-gnu-pkg-config
421
[   14s] checking pkg-config is at least version 0.20... yes
422
[   14s] checking for libosmocore >= 1.0.0... yes
423
[   14s] checking for libosmovty >= 1.0.0... yes
424
[   14s] checking for libosmoctrl >= 1.0.0... yes
425
[   14s] checking for libosmogsm >= 1.0.0... yes
426
[   14s] checking for libosmoabis >= 0.6.0... yes
427
[   14s] checking for libosmo-netif >= 0.4.0... yes
428
[   15s] checking for libosmo-sigtran >= 1.0.0... yes
429
[   15s] checking for libosmo-sccp >= 1.0.0... yes
430
[   15s] checking for libosmo-mgcp-client >= 1.5.0... yes
431
[   15s] checking for libosmo-gsup-client >= 1.0.0... yes
432
[   15s] checking for library containing sctp_send... -lsctp
433
[   15s] checking for libasn1c >= 0.9.30... yes
434
[   15s] checking for libosmo-ranap >= 0.3.0... yes
435
[   15s] checking for ANSI C header files... (cached) yes
436
[   15s] checking dbi/dbd.h usability... yes
437
[   15s] checking dbi/dbd.h presence... yes
438
[   15s] checking for dbi/dbd.h... yes
439
[   15s] checking whether C compiler accepts -Werror=implicit... yes
440
[   15s] checking whether C compiler accepts -Werror=maybe-uninitialized... yes
441
[   15s] checking whether C compiler accepts -Werror=memset-transposed-args... yes
442
[   15s] checking whether C compiler accepts -Werror=null-dereference... yes
443
[   15s] checking whether C compiler accepts -Werror=sizeof-array-argument... yes
444
[   15s] checking whether C compiler accepts -Werror=sizeof-pointer-memaccess... yes
445
[   15s] checking whether to enable code coverage support... no
446
[   15s] checking whether struct tm has tm_gmtoff member... yes
447
[   15s] checking whether to enable VTY/CTRL tests... no
448
[   15s] CFLAGS="-O2 -Wall -D_FORTIFY_SOURCE=2 -fstack-protector-strong -funwind-tables -fasynchronous-unwind-tables -fstack-clash-protection -flto=4 -g -Werror=implicit -Werror=maybe-uninitialized -Werror=memset-transposed-args -Werror=null-dereference -Werror=sizeof-array-argument -Werror=sizeof-pointer-memaccess"
449
[   15s] CPPFLAGS=""
450
[   15s] checking that generated files are newer than configure... done
451
[   15s] configure: creating ./config.status
452
[   17s] config.status: creating include/Makefile
453
[   17s] config.status: creating include/osmocom/Makefile
454
[   17s] config.status: creating include/osmocom/msc/Makefile
455
[   17s] config.status: creating src/Makefile
456
[   17s] config.status: creating src/libmsc/Makefile
457
[   17s] config.status: creating src/libvlr/Makefile
458
[   17s] config.status: creating src/osmo-msc/Makefile
459
[   17s] config.status: creating src/utils/Makefile
460
[   17s] config.status: creating tests/Makefile
461
[   17s] config.status: creating tests/atlocal
462
[   17s] config.status: creating tests/smpp/Makefile
463
[   17s] config.status: creating tests/db_sms/Makefile
464
[   17s] config.status: creating tests/sms_queue/Makefile
465
[   17s] config.status: creating tests/msc_vlr/Makefile
466
[   17s] config.status: creating doc/Makefile
467
[   17s] config.status: creating doc/examples/Makefile
468
[   17s] config.status: creating doc/manuals/Makefile
469
[   17s] config.status: creating doc/sequence_charts/Makefile
470
[   17s] config.status: creating contrib/Makefile
471
[   17s] config.status: creating contrib/systemd/Makefile
472
[   17s] config.status: creating Makefile
473
[   17s] config.status: creating config.h
474
[   17s] config.status: executing tests/atconfig commands
475
[   17s] config.status: executing depfiles commands
476
[   17s] config.status: executing libtool commands
477
[   18s] + make -j4
478
[   18s] echo 1.3.1.179 > .version-t && mv .version-t .version
479
[   18s] make  all-recursive
480
[   18s] make[1]: Entering directory '/home/abuild/rpmbuild/BUILD/osmo-msc-1.3.1.179'
481
[   18s] Making all in doc
482
[   18s] make[2]: Entering directory '/home/abuild/rpmbuild/BUILD/osmo-msc-1.3.1.179/doc'
483
[   18s] Making all in examples
484
[   18s] make[3]: Entering directory '/home/abuild/rpmbuild/BUILD/osmo-msc-1.3.1.179/doc/examples'
485
[   18s] make[3]: Nothing to be done for 'all'.
486
[   18s] make[3]: Leaving directory '/home/abuild/rpmbuild/BUILD/osmo-msc-1.3.1.179/doc/examples'
487
[   18s] Making all in manuals
488
[   18s] make[3]: Entering directory '/home/abuild/rpmbuild/BUILD/osmo-msc-1.3.1.179/doc/manuals'
489
[   18s] make[3]: Nothing to be done for 'all'.
490
[   18s] make[3]: Leaving directory '/home/abuild/rpmbuild/BUILD/osmo-msc-1.3.1.179/doc/manuals'
491
[   18s] Making all in sequence_charts
492
[   18s] make[3]: Entering directory '/home/abuild/rpmbuild/BUILD/osmo-msc-1.3.1.179/doc/sequence_charts'
493
[   18s] echo "built only on manual invocation, needs mscgen and dot (graphviz) programs: invoke 'make charts'"
494
[   18s] built only on manual invocation, needs mscgen and dot (graphviz) programs: invoke 'make charts'
495
[   18s] make[3]: Leaving directory '/home/abuild/rpmbuild/BUILD/osmo-msc-1.3.1.179/doc/sequence_charts'
496
[   18s] make[3]: Entering directory '/home/abuild/rpmbuild/BUILD/osmo-msc-1.3.1.179/doc'
497
[   18s] make[3]: Nothing to be done for 'all-am'.
498
[   18s] make[3]: Leaving directory '/home/abuild/rpmbuild/BUILD/osmo-msc-1.3.1.179/doc'
499
[   18s] make[2]: Leaving directory '/home/abuild/rpmbuild/BUILD/osmo-msc-1.3.1.179/doc'
500
[   18s] Making all in include
501
[   18s] make[2]: Entering directory '/home/abuild/rpmbuild/BUILD/osmo-msc-1.3.1.179/include'
502
[   18s] Making all in osmocom
503
[   18s] make[3]: Entering directory '/home/abuild/rpmbuild/BUILD/osmo-msc-1.3.1.179/include/osmocom'
504
[   18s] Making all in msc
505
[   18s] make[4]: Entering directory '/home/abuild/rpmbuild/BUILD/osmo-msc-1.3.1.179/include/osmocom/msc'
506
[   18s] make[4]: Nothing to be done for 'all'.
507
[   18s] make[4]: Leaving directory '/home/abuild/rpmbuild/BUILD/osmo-msc-1.3.1.179/include/osmocom/msc'
508
[   18s] make[4]: Entering directory '/home/abuild/rpmbuild/BUILD/osmo-msc-1.3.1.179/include/osmocom'
509
[   18s] make[4]: Nothing to be done for 'all-am'.
510
[   18s] make[4]: Leaving directory '/home/abuild/rpmbuild/BUILD/osmo-msc-1.3.1.179/include/osmocom'
511
[   18s] make[3]: Leaving directory '/home/abuild/rpmbuild/BUILD/osmo-msc-1.3.1.179/include/osmocom'
512
[   18s] make[3]: Entering directory '/home/abuild/rpmbuild/BUILD/osmo-msc-1.3.1.179/include'
513
[   18s] make[3]: Nothing to be done for 'all-am'.
514
[   18s] make[3]: Leaving directory '/home/abuild/rpmbuild/BUILD/osmo-msc-1.3.1.179/include'
515
[   18s] make[2]: Leaving directory '/home/abuild/rpmbuild/BUILD/osmo-msc-1.3.1.179/include'
516
[   18s] Making all in src
517
[   18s] make[2]: Entering directory '/home/abuild/rpmbuild/BUILD/osmo-msc-1.3.1.179/src'
518
[   18s] Making all in libvlr
519
[   18s] make[3]: Entering directory '/home/abuild/rpmbuild/BUILD/osmo-msc-1.3.1.179/src/libvlr'
520
[   18s]   CC       vlr_auth_fsm.o
521
[   18s]   CC       vlr.o
522
[   18s]   CC       vlr_access_req_fsm.o
523
[   18s]   CC       vlr_lu_fsm.o
524
[   18s]   CC       vlr_sgs.o
525
[   18s]   CC       vlr_sgs_fsm.o
526
[   18s]   AR       libvlr.a
527
[   18s] make[3]: Leaving directory '/home/abuild/rpmbuild/BUILD/osmo-msc-1.3.1.179/src/libvlr'
528
[   18s] Making all in libmsc
529
[   18s] make[3]: Entering directory '/home/abuild/rpmbuild/BUILD/osmo-msc-1.3.1.179/src/libmsc'
530
[   18s]   CC       call_leg.o
531
[   18s]   CC       sccp_ran.o
532
[   18s]   CC       cell_id_list.o
533
[   18s]   CC       msc_vty.o
534
[   18s]   CC       db.o
535
[   18s]   CC       e_link.o
536
[   18s]   CC       gsm_04_08.o
537
[   18s] db.c: In function 'db_sms_store':
538
[   18s] db.c:741:3: warning: format '%lld' expects argument of type 'long long int', but argument 3 has type 'long int' [-Wformat=]
539
[   18s]   741 |   "INSERT INTO SMS "
540
[   18s]       |   ^~~~~~~~~~~~~~~~~~
541
[   18s] ......
542
[   18s]   756 |   (int64_t)now, (int64_t)validity_timestamp,
543
[   18s]       |   ~~~~~~~~~~~~
544
[   18s]       |   |
545
[   18s]       |   long int
546
[   18s] db.c:749:18: note: format string is defined here
547
[   18s]   749 |   "(datetime('%lld', 'unixepoch'), datetime('%lld', 'unixepoch'), "
548
[   18s]       |               ~~~^
549
[   18s]       |                  |
550
[   18s]       |                  long long int
551
[   18s]       |               %ld
552
[   18s] db.c:741:3: warning: format '%lld' expects argument of type 'long long int', but argument 4 has type 'long int' [-Wformat=]
553
[   18s]   741 |   "INSERT INTO SMS "
554
[   18s]       |   ^~~~~~~~~~~~~~~~~~
555
[   18s] ......
556
[   18s]   756 |   (int64_t)now, (int64_t)validity_timestamp,
557
[   18s]       |                 ~~~~~~~~~~~~~~~~~~~~~~~~~~~
558
[   18s]       |                 |
559
[   18s]       |                 long int
560
[   18s] db.c:749:49: note: format string is defined here
561
[   18s]   749 |   "(datetime('%lld', 'unixepoch'), datetime('%lld', 'unixepoch'), "
562
[   18s]       |                                              ~~~^
563
[   18s]       |                                                 |
564
[   18s]       |                                                 long long int
565
[   18s]       |                                              %ld
566
[   18s]   CC       gsm_04_08_cc.o
567
[   18s]   CC       gsm_04_11.o
568
[   18s] gsm_04_08_cc.c: In function 'count_statistics':
569
[   18s] gsm_04_08_cc.c:164:3: warning: 'osmo_counter_inc' is deprecated: Implement as osmo_stat_item instead [-Wdeprecated-declarations]
570
[   18s]   164 |   osmo_counter_inc(trans->net->active_calls);
571
[   18s]       |   ^~~~~~~~~~~~~~~~
572
[   18s] In file included from /usr/include/libosmocore/osmocom/core/statistics.h:2,
573
[   18s]                  from ../../include/osmocom/msc/gsm_data_shared.h:9,
574
[   18s]                  from ../../include/osmocom/msc/gsm_data.h:21,
575
[   18s]                  from ../../include/osmocom/msc/gsm_subscriber.h:10,
576
[   18s]                  from ../../include/osmocom/msc/db.h:25,
577
[   18s]                  from gsm_04_08_cc.c:33:
578
[   18s] /usr/include/libosmocore/osmocom/core/counter.h:28:20: note: declared here
579
[   18s]    28 | static inline void osmo_counter_inc(struct osmo_counter *ctr)
580
[   18s]       |                    ^~~~~~~~~~~~~~~~
581
[   18s] gsm_04_08_cc.c:172:3: warning: 'osmo_counter_dec' is deprecated: Implement as osmo_stat_item instead [-Wdeprecated-declarations]
582
[   18s]   172 |   osmo_counter_dec(trans->net->active_calls);
583
[   18s]       |   ^~~~~~~~~~~~~~~~
584
[   18s] In file included from /usr/include/libosmocore/osmocom/core/statistics.h:2,
585
[   18s]                  from ../../include/osmocom/msc/gsm_data_shared.h:9,
586
[   18s]                  from ../../include/osmocom/msc/gsm_data.h:21,
587
[   18s]                  from ../../include/osmocom/msc/gsm_subscriber.h:10,
588
[   18s]                  from ../../include/osmocom/msc/db.h:25,
589
[   18s]                  from gsm_04_08_cc.c:33:
590
[   18s] /usr/include/libosmocore/osmocom/core/counter.h:20:20: note: declared here
591
[   18s]    20 | static inline void osmo_counter_dec(struct osmo_counter *ctr)
592
[   18s]       |                    ^~~~~~~~~~~~~~~~
593
[   18s]   CC       gsm_04_11_gsup.o
594
[   18s]   CC       gsm_04_14.o
595
[   18s]   CC       gsm_04_80.o
596
[   18s]   CC       gsm_09_11.o
597
[   18s] gsm_09_11.c: In function 'gsm0911_rcv_nc_ss':
598
[   18s] gsm_09_11.c:161:3: warning: 'osmo_counter_inc' is deprecated: Implement as osmo_stat_item instead [-Wdeprecated-declarations]
599
[   18s]   161 |   osmo_counter_inc(net->active_nc_ss);
600
[   18s]       |   ^~~~~~~~~~~~~~~~
601
[   18s] In file included from /usr/include/libosmocore/osmocom/core/statistics.h:2,
602
[   18s]                  from ../../include/osmocom/msc/gsm_data_shared.h:9,
603
[   18s]                  from ../../include/osmocom/msc/gsm_data.h:21,
604
[   18s]                  from ../../include/osmocom/msc/gsm_subscriber.h:10,
605
[   18s]                  from gsm_09_11.c:43:
606
[   18s] /usr/include/libosmocore/osmocom/core/counter.h:28:20: note: declared here
607
[   18s]    28 | static inline void osmo_counter_inc(struct osmo_counter *ctr)
608
[   18s]       |                    ^~~~~~~~~~~~~~~~
609
[   18s] gsm_09_11.c: In function 'establish_nc_ss_trans':
610
[   18s] gsm_09_11.c:365:2: warning: 'osmo_counter_inc' is deprecated: Implement as osmo_stat_item instead [-Wdeprecated-declarations]
611
[   18s]   365 |  osmo_counter_inc(net->active_nc_ss);
612
[   18s]       |  ^~~~~~~~~~~~~~~~
613
[   18s] In file included from /usr/include/libosmocore/osmocom/core/statistics.h:2,
614
[   18s]                  from ../../include/osmocom/msc/gsm_data_shared.h:9,
615
[   18s]                  from ../../include/osmocom/msc/gsm_data.h:21,
616
[   18s]                  from ../../include/osmocom/msc/gsm_subscriber.h:10,
617
[   18s]                  from gsm_09_11.c:43:
618
[   18s] /usr/include/libosmocore/osmocom/core/counter.h:28:20: note: declared here
619
[   18s]    28 | static inline void osmo_counter_inc(struct osmo_counter *ctr)
620
[   18s]       |                    ^~~~~~~~~~~~~~~~
621
[   18s] gsm_09_11.c: In function '_gsm911_nc_ss_trans_free':
622
[   18s] gsm_09_11.c:417:2: warning: 'osmo_counter_dec' is deprecated: Implement as osmo_stat_item instead [-Wdeprecated-declarations]
623
[   18s]   417 |  osmo_counter_dec(trans->net->active_nc_ss);
624
[   18s]       |  ^~~~~~~~~~~~~~~~
625
[   18s] In file included from /usr/include/libosmocore/osmocom/core/statistics.h:2,
626
[   18s]                  from ../../include/osmocom/msc/gsm_data_shared.h:9,
627
[   18s]                  from ../../include/osmocom/msc/gsm_data.h:21,
628
[   18s]                  from ../../include/osmocom/msc/gsm_subscriber.h:10,
629
[   18s]                  from gsm_09_11.c:43:
630
[   18s] /usr/include/libosmocore/osmocom/core/counter.h:20:20: note: declared here
631
[   18s]    20 | static inline void osmo_counter_dec(struct osmo_counter *ctr)
632
[   18s]       |                    ^~~~~~~~~~~~~~~~
633
[   18s]   CC       gsup_client_mux.o
634
[   18s]   CC       mncc.o
635
[   18s]   CC       mncc_builtin.o
636
[   19s]   CC       mncc_sock.o
637
[   19s]   CC       mncc_call.o
638
[   19s]   CC       msub.o
639
[   19s]   CC       msc_a.o
640
[   19s]   CC       msc_a_remote.o
641
[   19s]   CC       msc_i.o
642
[   19s]   CC       msc_i_remote.o
643
[   19s]   CC       msc_t.o
644
[   19s]   CC       msc_t_remote.o
645
[   19s]   CC       msc_ho.o
646
[   19s]   CC       neighbor_ident.o
647
[   19s]   CC       neighbor_ident_vty.o
648
[   19s]   CC       paging.o
649
[   19s]   CC       ran_conn.o
650
[   19s]   CC       ran_infra.o
651
[   19s]   CC       ran_msg.o
652
[   19s]   CC       ran_msg_a.o
653
[   19s]   CC       ran_peer.o
654
[   19s]   CC       rrlp.o
655
[   19s]   CC       rtp_stream.o
656
[   19s]   CC       silent_call.o
657
[   19s]   CC       sms_queue.o
658
[   19s]   CC       transaction.o
659
[   19s]   CC       msc_net_init.o
660
[   19s]   CC       ctrl_commands.o
661
[   19s] msc_net_init.c: In function 'gsm_network_init':
662
[   19s] msc_net_init.c:69:2: warning: 'osmo_counter_alloc' is deprecated: Implement as osmo_stat_item instead [-Wdeprecated-declarations]
663
[   19s]    69 |  net->active_calls = osmo_counter_alloc("msc.active_calls");
664
[   19s]       |  ^~~
665
[   19s] In file included from /usr/include/libosmocore/osmocom/core/statistics.h:2,
666
[   19s]                  from ../../include/osmocom/msc/gsm_data_shared.h:9,
667
[   19s]                  from ../../include/osmocom/msc/gsm_data.h:21,
668
[   19s]                  from msc_net_init.c:28:
669
[   19s] /usr/include/libosmocore/osmocom/core/counter.h:47:22: note: declared here
670
[   19s]    47 | struct osmo_counter *osmo_counter_alloc(const char *name)
671
[   19s]       |                      ^~~~~~~~~~~~~~~~~~
672
[   19s] msc_net_init.c:70:2: warning: 'osmo_counter_alloc' is deprecated: Implement as osmo_stat_item instead [-Wdeprecated-declarations]
673
[   19s]    70 |  net->active_nc_ss = osmo_counter_alloc("msc.active_nc_ss");
674
[   19s]       |  ^~~
675
[   19s] In file included from /usr/include/libosmocore/osmocom/core/statistics.h:2,
676
[   19s]                  from ../../include/osmocom/msc/gsm_data_shared.h:9,
677
[   19s]                  from ../../include/osmocom/msc/gsm_data.h:21,
678
[   19s]                  from msc_net_init.c:28:
679
[   19s] /usr/include/libosmocore/osmocom/core/counter.h:47:22: note: declared here
680
[   19s]    47 | struct osmo_counter *osmo_counter_alloc(const char *name)
681
[   19s]       |                      ^~~~~~~~~~~~~~~~~~
682
[   19s]   CC       sgs_iface.o
683
[   19s]   CC       sgs_server.o
684
[   19s]   CC       sgs_vty.o
685
[   19s]   CC       ran_msg_iu.o
686
[   20s]   AR       libmsc.a
687
[   20s] make[3]: Leaving directory '/home/abuild/rpmbuild/BUILD/osmo-msc-1.3.1.179/src/libmsc'
688
[   20s] Making all in osmo-msc
689
[   20s] make[3]: Entering directory '/home/abuild/rpmbuild/BUILD/osmo-msc-1.3.1.179/src/osmo-msc'
690
[   20s]   CC       msc_main.o
691
[   20s]   CCLD     osmo-msc
692
[   22s] msc_vty.c: In function '_send_sms_str':
693
[   22s] msc_vty.c:1077:19: error: potential null pointer dereference [-Werror=null-dereference]
694
[   22s] lto1: some warnings being treated as errors
695
[   22s] make[4]: *** [/tmp/ccTM0xLz.mk:17: /tmp/osmo-msc.fCOdvX.ltrans5.ltrans.o] Error 1
696
[   22s] make[4]: *** Waiting for unfinished jobs....
697
[   22s] msc_ho.c: In function 'msc_ho_down_required_reject':
698
[   22s] msc_ho.c:80:14: error: potential null pointer dereference [-Werror=null-dereference]
699
[   22s] lto1: some warnings being treated as errors
700
[   22s] make[4]: *** [/tmp/ccTM0xLz.mk:8: /tmp/osmo-msc.fCOdvX.ltrans2.ltrans.o] Error 1
701
[   22s] lto-wrapper: fatal error: make returned 2 exit status
702
[   22s] compilation terminated.
703
[   22s] /usr/lib64/gcc/x86_64-suse-linux/9/../../../../x86_64-suse-linux/bin/ld: error: lto-wrapper failed
704
[   22s] collect2: error: ld returned 1 exit status
705
[   22s] make[3]: *** [Makefile:484: osmo-msc] Error 1
706
[   22s] make[3]: Leaving directory '/home/abuild/rpmbuild/BUILD/osmo-msc-1.3.1.179/src/osmo-msc'
707
[   22s] make[2]: *** [Makefile:421: all-recursive] Error 1
708
[   22s] make[2]: Leaving directory '/home/abuild/rpmbuild/BUILD/osmo-msc-1.3.1.179/src'
709
[   22s] make[1]: *** [Makefile:461: all-recursive] Error 1
710
[   22s] make[1]: Leaving directory '/home/abuild/rpmbuild/BUILD/osmo-msc-1.3.1.179'
711
[   22s] make: *** [Makefile:393: all] Error 2
712
[   22s] error: Bad exit status from /var/tmp/rpm-tmp.co5mLl (%build)
713
[   22s] 
714
[   22s] 
715
[   22s] RPM build errors:
716
[   22s]     Bad exit status from /var/tmp/rpm-tmp.co5mLl (%build)
717
[   22s] 
718
[   22s] build failed "build osmo-msc.spec" at Wed Jul 17 21:58:37 UTC 2019.
719
[   22s] 
Add picture from clipboard (Maximum size: 48.8 MB)